program: Gaussian 16
title: h_biphenylene
version: ES64L-G16RevC.02
method: RwB97XD
basis: GenECP
operation: Freq
keyword: #N
keyword: Geom=AllCheck
keyword: Guess=TCheck
keyword: SCRF=Check
keyword: GenChk
keyword: RwB97XD/GenECP
keyword: Freq
converged: YES YES NO YES
title: Mulliken charges:
elementType: C C C C C C C H C H H C H C H C C H B N C H H H C H H H H H
charge: 0.115810 0.436209 0.006232 -0.191727 -0.501057 -0.297081 -0.201187 0.193650 0.018143 0.239459 0.201363 -0.429011 0.214418 -0.306045 0.231446 -0.265324 0.268889 0.246850 -0.289978 0.181803 -0.369050 0.158407 0.180663 0.164543 -0.486152 0.199571 0.177940 0.067359 0.043450 -0.009592
chargesum: -0.00000
title: Mulliken charges with hydrogens summed into heavy atoms:
elementType: C C C C C C C C C C C C B N C C
charge: 0.115810 0.436209 0.006232 -0.191727 -0.307407 -0.297081 0.038272 0.219505 -0.214593 -0.074599 -0.018474 0.268889 -0.256121 0.181803 0.134563 -0.041282
chargesum: 0.00000
1716.lowfreq: -13.0931 -5.7583 -2.4483 -0.0002 0.0004 0.0004 55.1207 89.3996 102.8616
frequency: 54.8617 89.3951 102.8610 129.0501 157.2263 189.6549 217.6084 229.3218 275.9315 284.1881 314.9531 336.6545 348.5755 366.7728 377.2815 452.7652 469.2251 479.1513 527.0473 565.0703 592.5317 610.4774 641.1037 647.6321 731.7109 746.0669 780.3495 794.1969 813.0838 828.3756 851.1793 905.4560 932.2477 948.1268 996.6266 997.4447 1004.1732 1006.4967 1015.7524 1054.9888 1077.9350 1088.1672 1122.4711 1138.0769 1159.4437 1171.6780 1191.0991 1194.9684 1201.4265 1224.0584 1242.5034 1276.4568 1296.2354 1323.3502 1392.2549 1403.0557 1442.4994 1452.5768 1477.3579 1485.6447 1489.6445 1500.4330 1502.4317 1514.2603 1527.5377 1537.4612 1632.6787 1659.0847 1673.0262 1737.8394 2564.9061 2653.6842 2971.1535 2982.6160 3094.0862 3096.6559 3140.5907 3167.0720 3182.2243 3190.7009 3199.0106 3212.3229 3218.5123 3223.5616
redmass: 3.2432 3.2727 4.4774 2.7219 3.4047 1.9640 1.8792 2.1630 2.1009 1.3610 1.9456 1.6831 4.1203 3.2046 3.0413 3.6918 3.9610 3.6625 4.3706 3.4551 4.6192 5.1739 5.0189 4.9297 3.7873 3.6234 1.5410 1.5490 4.4091 4.4919 1.7203 1.3959 3.8605 1.3800 1.3193 3.5867 1.4323 4.0370 1.4662 2.8837 1.7003 1.4340 1.2799 2.2059 2.0176 1.4690 1.5273 1.7889 1.4426 2.4068 1.7318 1.9808 3.2227 3.0454 2.7550 2.4016 2.4507 1.2059 1.2666 1.1920 1.7378 1.0550 1.1175 1.3142 6.6040 1.7171 8.6264 9.0963 6.7230 8.3347 1.0593 1.1218 1.0559 1.0560 1.0777 1.0832 1.1042 1.0992 1.0872 1.0882 1.0925 1.0968 1.0922 1.0955
irintensity: 1.7087 0.2283 4.9754 3.8013 0.0937 1.1455 1.1773 0.0686 6.7949 0.4752 1.4667 0.9757 2.3930 0.1391 1.4416 4.7064 7.3836 1.0686 11.7584 3.9726 0.3230 3.6308 7.5092 0.9760 16.4878 19.7941 2.0242 118.7854 15.4340 3.9968 18.5766 0.7742 13.3527 1.7069 1.1693 47.3623 13.9169 12.4346 44.5418 29.1895 12.9145 14.9062 7.5219 84.3815 38.2297 40.8720 41.5863 15.7103 9.0718 4.3803 2.9659 73.6490 32.4594 78.8035 141.0543 54.9456 19.6900 4.1782 26.1211 2.4928 20.1738 37.1864 19.5202 3.5656 4.0440 147.5114 187.8759 99.5354 174.1252 29.6440 282.2371 133.8214 112.7235 136.4931 38.2840 28.9566 20.4747 15.5364 2.9498 9.0852 17.9608 25.2603 11.1643 16.5384
temp: 298.150 k
press: 1.00000 atm
elementType: 6 6 6 6 6 6 6 1 6 1 1 6 1 6 1 6 6 1 5 7 6 1 1 1 6 1 1 1 1 1
symmnumber: 1
zpe: 639394.2 jmol-1
zpe.correction: 0.243532 hartree
zpe.thermalcorrener: 0.257300 hartree
zpe.thermalcorrenthalpy: 0.258245 hartree
zpe.thermalcorrgfe: 0.203781 hartree
zpe.sumelectzpe: -621.128672 hartree
zpe.sumelectthermal: -621.114904 hartree
zpe.sumelectthermalent: -621.113960 hartree
zpe.sumelectthermalfe: -621.168423 hartree
dipole: -1.0874 1.6511 -0.1058
dipole: 1.9798
quadrupole: -102.7319 -74.7260 -84.7229
quadrupole: -3.4494 -4.4037 5.7231
quadrupole: -15.3383 12.6676 2.6707 -3.4494 -4.4037 5.7231
hfenergy: -621.3722046 hartree
pointgroup: C01 [X(C14H14B1N1)]
dipole: -0.4278048 0.6495846 -0.0416185 debye
polarizability: 129.5860557|-42.8970333|304.2400433|-7.0864671|8.0515824|257.273471 unknown
InChI: InChI=1/C14H14BN/c1-16(2)12-8-4-6-10-9-5-3-7-11(15)13(9)14(10)12/h3-8H,15H2,1-2H3
charge 0 multiplicity 1
30 atoms
C  1.84455972 2.46000641 -0.17892342
C  1.81176151 2.53315273 -1.59597376
C  1.51327748 4.00599505 -1.50901159
C  1.49547606 3.92267624 -0.09960817
C  1.35829518 5.17738337 -2.19732402
C  1.25067182 5.01985782 0.70787262
C  1.1575073 6.31393809 -1.38608639
H  1.39253916 5.25084988 -3.27680888
C  1.09901243 6.24302811 -0.00473189
H  1.02576442 7.28251972 -1.85641932
H  0.91280531 7.15701916 0.54471997
C  2.06078407 1.45553262 -2.39091627
H  2.04517263 1.50055133 -3.47368854
C  2.35899902 0.24005939 -1.71576926
H  2.55510442 -0.65212338 -2.29985363
C  2.42594564 0.17959815 -0.34269487
C  2.18994953 1.31167472 0.51053361
H  2.68515124 -0.76349449 0.12809603
B  2.44801326 1.23621461 2.02298904
N  1.16174631 4.93017065 2.0961873
C  1.1374917 6.16419764 2.85584415
H  0.19113605 6.71828421 2.74711419
H  1.26637464 5.92244786 3.91260411
H  1.96279937 6.81194416 2.55616559
C  0.22616619 3.93912524 2.60892433
H  0.48975183 3.6790202 3.63649833
H  -0.80590126 4.3225073 2.59543479
H  0.26036005 3.03068431 2.01065271
H  2.38204107 2.21040601 2.70853168
H  2.75967939 0.19002891 2.51599725
