program: Gaussian 16
title: h_dibenzofuran
version: ES64L-G16RevC.02
method: RwB97XD
basis: GenECP
operation: Freq
keyword: #N
keyword: Geom=AllCheck
keyword: Guess=TCheck
keyword: SCRF=Check
keyword: GenChk
keyword: RwB97XD/GenECP
keyword: Freq
converged: YES YES NO YES
title: Mulliken charges:
elementType: C C O C C C C C H C H H C H C H C C H B N C H H H C H H H H H
charge: -1.368357 1.236982 0.028339 1.371577 -1.243700 -0.374744 -0.429874 -0.378005 0.174547 0.415362 0.237321 0.195670 -0.272655 0.197484 -0.290854 0.235186 -0.209993 0.152779 0.255521 -0.180607 0.085846 -0.455126 0.172395 0.167193 0.153271 -0.380683 0.182996 0.162006 0.165291 -0.024919 0.019750
chargesum: -0.00000
title: Mulliken charges with hydrogens summed into heavy atoms:
elementType: C C O C C C C C C C C C C B N C C
charge: -1.368357 1.236982 0.028339 1.371577 -1.243700 -0.200197 -0.429874 -0.140684 0.611032 -0.075171 -0.055668 0.045529 0.152779 -0.185777 0.085846 0.037734 0.129610
chargesum: 0.00000
1716.lowfreq: -9.1972 -3.6319 -0.0006 -0.0006 0.0004 5.9171 64.5511 66.4760 100.3337
frequency: 64.5265 66.4612 100.3332 124.9651 145.1700 184.1653 206.5847 232.2221 266.8615 287.7930 300.1687 311.4204 315.4861 341.5058 372.1664 384.8841 482.6578 493.7807 509.5733 568.0483 573.4220 587.7398 597.9201 617.7691 636.2950 707.6653 755.7671 781.1960 792.4062 800.4972 820.5665 841.0870 866.4200 895.5244 899.2227 950.9378 960.3644 990.3860 1006.0175 1014.6012 1038.1901 1083.6656 1097.3944 1099.0466 1125.6960 1157.2742 1175.6691 1187.1590 1192.9428 1213.6982 1231.5245 1242.7007 1267.2723 1291.2211 1306.8516 1336.4516 1363.6259 1385.5445 1392.6592 1445.8966 1452.2001 1470.5549 1479.2320 1490.3431 1501.6579 1504.6856 1520.8416 1529.9464 1553.3849 1643.3890 1664.6545 1672.0444 1690.1669 2569.0326 2650.1727 2970.0458 2981.9440 3092.7800 3101.6361 3138.9016 3174.6012 3189.1104 3194.6404 3198.9141 3214.4047 3215.2509 3226.9979
redmass: 2.9214 3.5423 4.5416 3.6227 2.7884 1.6059 1.7579 2.8390 2.2628 1.3764 2.3158 1.8149 4.4836 2.8786 3.6863 2.9477 3.7864 3.9665 5.2159 3.7638 3.8493 4.0814 6.3447 4.8354 4.6523 7.0171 1.7116 2.6485 5.8385 2.0002 2.4318 1.6709 5.8663 4.6194 1.4361 3.9755 1.3631 1.3018 1.3617 1.4208 2.9790 1.4391 2.0640 1.8635 1.2651 2.2354 1.4417 1.2544 1.2659 2.7585 1.7757 2.3780 2.5502 3.2588 2.2376 2.1534 7.2351 4.2286 3.3076 1.5778 1.9467 1.9196 1.4281 1.0420 1.1222 1.0456 1.1865 2.9123 2.9274 7.0280 7.5749 7.0521 8.5759 1.0558 1.1269 1.0560 1.0564 1.0773 1.0830 1.1043 1.0993 1.0878 1.0875 1.0914 1.0948 1.0973 1.0934
irintensity: 1.2809 1.8570 2.8383 2.3942 0.7792 0.4410 0.5059 0.9465 4.4850 0.2368 0.5967 2.0244 1.8791 0.5812 2.5217 1.6371 1.2473 0.2997 13.0059 1.0200 3.0947 3.0229 17.2963 3.1871 4.8640 1.1679 34.2359 39.6886 16.4810 82.3004 2.8072 29.6142 12.6123 12.0820 0.6168 21.5196 2.3578 0.4617 19.8095 26.1670 57.1944 22.8030 7.5115 27.4154 4.0759 56.8036 29.8929 17.1342 9.7946 202.5482 133.7547 24.7198 43.6877 34.3616 182.5861 18.1571 14.0737 30.3715 82.8580 53.1808 69.7583 27.4284 24.9369 17.1591 13.1184 25.8143 16.3831 48.8412 151.2501 31.3932 125.8363 80.0892 47.2910 261.2330 149.3735 97.4283 139.5942 35.5933 40.1180 23.6189 3.4242 1.2642 8.1371 7.7130 10.2300 26.4442 8.1706
temp: 298.150 k
press: 1.00000 atm
elementType: 6 6 8 6 6 6 6 6 1 6 1 1 6 1 6 1 6 6 1 5 7 6 1 1 1 6 1 1 1 1 1
symmnumber: 1
zpe: 655437.5 jmol-1
zpe.correction: 0.249643 hartree
zpe.thermalcorrener: 0.263948 hartree
zpe.thermalcorrenthalpy: 0.264892 hartree
zpe.thermalcorrgfe: 0.209110 hartree
zpe.sumelectzpe: -696.419081 hartree
zpe.sumelectthermal: -696.404776 hartree
zpe.sumelectthermalent: -696.403832 hartree
zpe.sumelectthermalfe: -696.459614 hartree
dipole: -0.1759 1.5565 -1.0593
dipole: 1.8909
quadrupole: -102.1764 -81.1759 -91.3882
quadrupole: -4.9834 -3.9348 5.5630
quadrupole: -10.5963 10.4043 0.1920 -4.9834 -3.9348 5.5630
hfenergy: -696.6687244 hartree
pointgroup: C01 [X(C14H14B1N1O1)]
dipole: -0.0691939 0.6123661 -0.41675 debye
polarizability: 156.3030974|-73.0938235|262.6875757|2.7139316|8.3779911|259.2477847 unknown
InChI: InChI=1/C14H14BNO/c1-16(2)12-8-4-6-10-9-5-3-7-11(15)13(9)17-14(10)12/h3-8H,15H2,1-2H3
charge 0 multiplicity 1
31 atoms
C  2.0982017 2.16243505 0.19005975
C  1.90974393 2.53505685 -1.14447623
O  1.6175973 3.11310936 1.0341203
C  1.25706607 3.82999269 -1.10484769
C  1.11740672 4.12259017 0.24934438
C  0.7689745 4.71135992 -2.07060795
C  0.51000849 5.28815747 0.73852931
C  0.15360039 5.8649346 -1.62062275
H  0.86090114 4.49508505 -3.12797302
C  0.03269474 6.15065018 -0.25459832
H  -0.24189862 6.57805131 -2.33503318
H  -0.4464375 7.07683396 0.03416278
C  2.33698974 1.67840275 -2.15429769
H  2.20092191 1.94349969 -3.19702137
C  2.94188561 0.47625071 -1.80280435
H  3.27988533 -0.20148489 -2.57773554
C  3.1163382 0.13635428 -0.46212929
C  2.70196261 0.96678416 0.59609791
H  3.59201396 -0.80686746 -0.21414958
B  2.91452901 0.56774554 2.06458053
N  0.35776873 5.51639349 2.10964783
C  1.56375758 5.4233264 2.92640624
H  2.22427639 6.29072499 2.77263398
H  1.27585528 5.39059428 3.97911047
H  2.11576234 4.51459638 2.69902209
C  -0.4864001 6.62953819 2.49573489
H  -0.65549185 6.57754621 3.57273623
H  -0.03838992 7.61070592 2.26846308
H  -1.45541441 6.56195504 1.99802945
H  2.57301807 1.28167408 2.95801811
H  3.43735773 -0.48035878 2.30829102
