program: Gaussian 16
title: Me_H
version: ES64L-G16RevC.01
method: RwB97XD
basis: GenECP
operation: Freq
keyword: #N
keyword: Geom=AllCheck
keyword: Guess=TCheck
keyword: SCRF=Check
keyword: GenChk
keyword: RwB97XD/GenECP
keyword: Freq
converged: YES YES YES YES
title: Mulliken charges:
elementType: C H C N N B C H H H H H C C H H H
charge: -0.007719 0.261593 -0.052042 0.051692 -0.104107 -0.088656 -0.391498 0.197742 0.197471 0.175199 -0.012536 -0.061721 -0.018017 -0.713682 0.178739 0.178291 0.209250
chargesum: -0.00000
title: Mulliken charges with hydrogens summed into heavy atoms:
elementType: C C N N B C C C
charge: 0.253874 -0.052042 0.051692 -0.104107 -0.162913 0.178914 -0.018017 -0.147402
1716.lowfreq: -32.9063 -9.0336 0.0003 0.0004 0.0008 15.2655 47.4756 135.9452 166.3459
frequency: 42.4821 135.9339 166.3331 208.8291 241.3218 286.0119 293.7012 394.3431 464.4875 612.2184 646.0311 653.7023 710.7036 809.9429 843.5748 852.6699 998.9425 1016.4530 1030.1757 1065.0863 1085.9657 1151.5116 1179.6626 1230.1117 1238.1169 1337.1506 1386.8465 1417.5916 1460.9729 1474.1904 1478.8768 1492.6980 1496.7247 1516.1574 1568.4459 1626.1252 2555.5084 2636.0325 3047.7528 3063.3542 3108.7411 3137.5243 3169.4035 3171.6302 3269.3046
redmass: 1.0925 1.7104 1.3741 2.5761 2.3511 2.5435 2.8336 1.2302 2.5963 4.1714 4.2937 3.0005 5.4182 3.2379 1.4354 1.5035 1.4299 2.9651 1.9968 1.5281 1.5856 1.3269 1.3938 2.7350 1.6476 5.2251 2.9443 1.5479 1.6044 1.2646 1.0405 1.9025 1.0426 1.2363 4.1518 7.3391 1.0590 1.1249 1.0395 1.0342 1.1013 1.1060 1.0998 1.1036 1.0996
irintensity: 0.0003 1.6490 0.6916 2.9584 0.1846 0.9526 1.2434 0.3181 2.4564 9.9218 5.9607 6.7287 1.6756 24.5886 29.7774 28.4311 44.6157 7.8825 0.4637 2.1323 43.2888 0.0959 15.6037 14.7333 68.4826 73.9000 34.2490 17.1020 26.3748 18.6210 1.9048 38.2333 29.6103 15.3363 163.9684 122.8098 255.0684 179.7135 23.0624 43.6433 14.6731 13.5520 7.1199 5.8102 0.0350
temp: 298.150 k
press: 1.00000 atm
elementType: 6 1 6 7 7 5 6 1 1 1 1 1 6 6 1 1 1
symmnumber: 1
zpe: 363505.3 jmol-1
zpe.correction: 0.138452 hartree
zpe.thermalcorrener: 0.146924 hartree
zpe.thermalcorrenthalpy: 0.147868 hartree
zpe.thermalcorrgfe: 0.105248 hartree
zpe.sumelectzpe: -330.135961 hartree
zpe.sumelectthermal: -330.127488 hartree
zpe.sumelectthermalent: -330.126544 hartree
zpe.sumelectthermalfe: -330.169165 hartree
dipole: -3.2149 5.8476 -0.6546
dipole: 6.7051
quadrupole: -65.0145 -35.7296 -47.2449
quadrupole: 10.6863 -0.6682 -0.2858
quadrupole: -15.6848 13.6000 2.0848 10.6863 -0.6682 -0.2858
hfenergy: -330.2744125 hartree
pointgroup: C01 [X(C5H9B1N2)]
dipole: -1.2648411 2.3006104 -0.2575316 debye
dipolederiv: 0.2761896 -0.4839616 0.2569981 -0.4737259 0.5346943 -0.3420564 0.2675489 -0.3639376 0.0910748 0.1590617 0.0317151 -0.0247605 0.0191207 0.0697747 -0.0792919 -0.0372466 -0.0548365 0.0531707 -0.5899363 0.5483916 -0.2449048 0.5542641 -0.8476322 0.4791462 -0.239538 0.4670459 -0.2156334 -0.4685867 0.4824369 -0.1942161 0.2557657 -0.68828 -0.037137 -0.4245909 0.4293273 -0.5711294 -0.3461821 -0.0177748 -0.0360254 0.0905805 -0.5314497 -0.0106084 0.0742598 -0.2322121 -0.4205109 0.7314421 -0.4744237 0.3300546 -0.4369386 0.9964687 -0.2249887 0.3677578 -0.3015764 0.7885069 0.3487408 -0.1863766 0.001101 -0.2036587 0.5797339 -0.0895423 -0.0165262 -0.0522251 0.1683447 0.0261584 0.0030381 0.0719807 0.0590046 -0.0419923 0.0563772 0.0364839 0.1255739 -0.0248449 -0.1151791 0.0632523 -0.0345488 -0.0326289 -0.0215445 0.0138888 -0.0403226 0.0246074 0.0978673 0.0838836 -0.007526 -0.064634 0.0375574 0.0200512 -0.0160342 -0.018576 -0.1077512 -0.0366573 -0.1699812 0.0147468 -0.0572352 -0.0470062 -0.1391284 -0.1013245 -0.1203935 0.0252297 -0.3569793 -0.1718975 0.0596405 -0.003622 0.1115383 -0.3455227 0.0200816 0.0496843 -0.0867308 -0.128691 0.1649864 -0.0737219 0.1098018 0.0135232 0.3233128 0.2807846 0.198536 0.0995148 0.5812521 0.062692 0.029181 -0.0898928 0.0517667 0.0417062 0.0262286 -0.0644336 -0.0223085 -0.0343831 -0.1277379 0.0418037 -0.041943 0.0395535 0.1009773 0.0105439 0.0313508 0.0102644 0.0019059 0.0431143 -0.0745258 0.0071701 -0.0471552 -0.0410092 0.1171573 -0.0425517 0.069969 -0.0258702 0.0932318 0.0441046 0.0146763 0.0084387 -0.01016 -0.1032249 -0.0214425 -0.0299542 0.032577 unknown
polarizability: 87.707857|-26.2419343|109.2939691|23.5598689|-7.0795629|104.4924502 unknown
InChI: InChI=1/C5H9BN2/c1-4-7-5(6)3-8(4)2/h3H,6H2,1-2H3
charge 0 multiplicity 1
17 atoms
C  2.72932431 1.6300265 1.03875711
H  2.87060013 2.22165027 1.93047491
C  3.19193475 0.36881264 0.70692136
N  1.99701474 2.0785688 -0.00985002
N  2.72212077 0.05984612 -0.57283151
B  4.05632525 -0.52615034 1.5733344
C  1.31181163 3.35314831 -0.11952403
H  1.70168555 3.92360581 -0.96435695
H  0.23986136 3.19878518 -0.25473814
H  1.4738762 3.92118614 0.79481996
H  4.39122828 -0.13877346 2.65726041
H  4.40580708 -1.60369932 1.19325093
C  2.02247413 1.08492523 -0.96819749
C  1.31694104 1.22791965 -2.27168862
H  0.24061193 1.36345526 -2.13089976
H  1.69173166 2.08592464 -2.83741765
H  1.4809298 0.32533952 -2.85768284
