program: Gaussian 16
title: F_H
version: ES64L-G16RevC.01
method: RwB97XD
basis: GenECP
operation: Freq
keyword: #N
keyword: Geom=AllCheck
keyword: Guess=TCheck
keyword: SCRF=Check
keyword: GenChk
keyword: RwB97XD/GenECP
keyword: Freq
converged: YES YES YES YES
title: Mulliken charges:
elementType: C H C N N B C H H H H H C F
charge: -0.165444 0.250857 -0.104982 -0.018003 -0.160986 -0.071488 -0.400759 0.214214 0.214876 0.176527 -0.001071 -0.055758 0.289085 -0.167066
chargesum: -0.00000
title: Mulliken charges with hydrogens summed into heavy atoms:
elementType: C C N N B C C F
charge: 0.085413 -0.104982 -0.018003 -0.160986 -0.128317 0.204856 0.289085 -0.167066
1716.lowfreq: -0.0007 0.0004 0.0006 7.4115 13.3303 19.7832 62.6886 149.1335 214.2909
frequency: 62.4212 149.1160 214.2765 243.4815 281.3344 309.8797 418.6306 528.4941 606.4007 657.9636 664.7699 720.3383 839.3726 841.3329 872.9199 998.8422 1007.3591 1086.9071 1155.2666 1183.2573 1231.3216 1253.5587 1336.7847 1422.1747 1456.1519 1489.1872 1496.5005 1515.9560 1574.7112 1659.1311 2565.4174 2649.5512 3075.8747 3156.8834 3181.8636 3276.6637
redmass: 1.0713 2.8643 4.1815 2.4221 4.0771 2.2316 1.6004 3.9900 4.8986 6.9251 3.4633 9.8081 1.4343 2.0722 2.7374 1.4248 5.1009 1.5604 1.3121 1.3321 1.7509 3.3041 5.0196 4.5638 1.6698 1.0397 3.2546 1.1886 3.9384 10.0797 1.0586 1.1258 1.0331 1.1068 1.1052 1.0999
irintensity: 0.0490 0.6350 0.1432 0.2968 2.1512 0.0300 0.0369 0.9453 29.4081 21.7296 7.8717 16.4734 26.0204 27.6328 3.3772 45.6816 4.3683 53.5568 0.0672 14.7483 105.0816 27.1364 60.2648 127.4637 22.2208 15.8004 147.6308 8.7652 125.6223 375.9008 214.6264 168.0797 31.1682 8.4157 4.7475 0.6602
temp: 298.150 k
press: 1.00000 atm
elementType: 6 1 6 7 7 5 6 1 1 1 1 1 6 9
symmnumber: 1
zpe: 270260.9 jmol-1
zpe.correction: 0.102937 hartree
zpe.thermalcorrener: 0.110528 hartree
zpe.thermalcorrenthalpy: 0.111473 hartree
zpe.thermalcorrgfe: 0.070752 hartree
zpe.sumelectzpe: -390.090512 hartree
zpe.sumelectthermal: -390.082921 hartree
zpe.sumelectthermalent: -390.081977 hartree
zpe.sumelectthermalfe: -390.122697 hartree
dipole: -2.0542 5.7618 1.5505
dipole: 6.3105
quadrupole: -57.1747 -31.7008 -49.6547
quadrupole: 10.9588 2.2079 1.9873
quadrupole: -10.9980 14.4759 -3.4779 10.9588 2.2079 1.9873
hfenergy: -390.1934491 hartree
pointgroup: C01 [X(C4H6B1F1N2)]
dipole: -0.8081696 2.2668673 0.6100302 debye
dipolederiv: 0.3158901 -0.5110981 0.3036276 -0.4884127 0.549224 -0.3485257 0.3267025 -0.3970623 0.1721728 0.1618224 0.0319127 -0.0228593 0.0183313 0.0787116 -0.0710738 -0.0360772 -0.044497 0.0732134 -0.5560929 0.5443917 -0.1360378 0.5615213 -0.8680443 0.4815079 -0.1196972 0.4477283 -0.0203294 -0.487099 0.5264726 -0.1945497 0.2568033 -0.7277196 -0.0737215 -0.4594535 0.4676394 -0.5866925 -0.4001091 0.0258641 -0.1587578 0.172631 -0.5963681 0.0605966 -0.0153476 -0.2301198 -0.5619036 0.7270874 -0.4736096 0.2839415 -0.4074025 0.9971943 -0.1778567 0.3481455 -0.3081868 0.7436487 0.3599826 -0.200648 0.0098422 -0.2303443 0.6104766 -0.1087584 -0.0177918 -0.0512112 0.1701171 0.0329639 0.0057336 0.0665332 0.0619271 -0.0354936 0.047845 0.0356466 0.1053478 -0.007259 -0.0910471 0.0615027 -0.0243021 -0.0235916 -0.0220155 0.0168724 -0.0221048 0.0165602 0.1033067 0.0811365 -0.0035711 -0.0641557 0.0378922 0.0236935 -0.0108312 -0.0243647 -0.0912214 -0.0225884 -0.1638109 0.0145222 -0.0501206 -0.0459659 -0.1376482 -0.0978394 -0.1098084 0.0223281 -0.3276757 -0.1655605 0.0522539 0.0031065 0.0980701 -0.3304651 0.0100332 0.0482728 -0.0812564 -0.1261597 0.689129 -0.2196913 0.5497006 -0.1238214 0.7206569 0.159854 0.6443805 -0.0340563 1.5517263 -0.5042923 0.1459647 -0.5659684 0.112362 -0.2622024 0.1118975 -0.5985028 0.1780075 -1.1615768 unknown
polarizability: 73.1867836|-25.04682|96.8567999|18.7397902|-5.3512081|83.3915455 unknown
InChI: InChI=1/C4H6BFN2/c1-8-2-3(5)7-4(8)6/h2H,5H2,1H3
charge 0 multiplicity 1
14 atoms
C  2.73843289 1.62941246 1.04778053
H  2.89668477 2.22006406 1.93676654
C  3.18728838 0.36728827 0.70791963
N  1.98749358 2.0893271 0.00722105
N  2.69700571 0.051377 -0.57191126
B  4.06035355 -0.53231449 1.56422907
C  1.29446295 3.36124143 -0.12038933
H  1.6733702 3.91191103 -0.98150188
H  0.22297238 3.19677184 -0.2358524
H  1.4732867 3.9407452 0.78302195
H  4.40827175 -0.13725503 2.63973514
H  4.39761939 -1.61131194 1.18187568
C  2.01889683 1.08218508 -0.91173316
F  1.36534514 1.24600464 -2.04745375
