program: Gaussian 16
title: h_indole
version: ES64L-G16RevC.02
method: RwB97XD
basis: GenECP
operation: Freq
keyword: #N
keyword: Geom=AllCheck
keyword: Guess=TCheck
keyword: SCRF=Check
keyword: GenChk
keyword: RwB97XD/GenECP
keyword: Freq
converged: YES YES NO NO
title: Mulliken charges:
elementType: C C C C C C C C H H H N H B C H H H C H H H H H
charge: 0.038439 0.094819 -0.466421 -0.807731 0.607237 -0.566924 -0.343066 0.389254 0.183076 0.203178 0.218274 0.246304 0.265230 -0.126184 -0.451016 0.196962 0.109820 0.196320 -0.505475 0.184286 0.175032 0.185563 -0.031992 0.005016
chargesum: -0.00000
title: Mulliken charges with hydrogens summed into heavy atoms:
elementType: C C C C C C C C N B C C
charge: 0.038439 0.360050 -0.466421 -0.624655 0.607237 -0.363747 -0.124791 0.389254 0.246304 -0.153160 0.052086 0.039405
chargesum: 0.00000
1716.lowfreq: -2.5914 -0.0002 -0.0001 0.0002 2.8510 8.6835 75.4093 81.9726 94.5849
frequency: 75.3564 81.9671 94.5815 139.5203 167.6189 208.8394 285.4024 304.0218 305.4403 351.2273 424.5590 448.9988 459.5288 515.7201 571.1577 620.0942 642.4999 645.9635 719.8199 774.3836 815.7887 820.9799 865.5772 867.4190 874.9043 876.4930 971.3834 987.8726 991.1271 1029.8993 1065.9515 1125.1439 1141.4732 1152.0695 1168.2347 1193.9407 1226.8087 1255.5028 1280.6421 1353.8708 1372.7384 1397.4417 1417.7666 1431.6110 1459.0586 1483.3931 1487.9800 1494.4246 1507.1917 1512.0943 1548.7613 1568.3820 1630.4923 1699.5813 2567.5264 2640.0593 3043.4391 3047.3994 3107.4370 3110.2275 3133.5226 3180.6167 3183.3921 3194.9341 3202.4164 3253.5144
redmass: 1.1202 1.3201 1.9531 2.7001 2.7019 2.9138 4.1295 2.4519 2.3664 2.7867 1.5733 5.0037 2.3691 3.1384 4.6577 3.0772 4.2373 4.2326 5.0882 3.1815 1.3106 3.6940 1.4428 2.8946 1.7556 1.5487 2.3533 1.4131 1.3229 1.5737 1.5486 1.8380 1.6267 1.3057 1.3876 1.5502 2.1527 1.6298 2.0824 2.4575 3.6673 4.2685 1.2964 4.6993 1.4641 1.0421 1.1570 1.0377 3.0277 1.1616 3.4008 4.5420 6.6373 6.9551 1.0568 1.1271 1.0369 1.0375 1.1009 1.1054 1.1022 1.0878 1.0988 1.0917 1.0961 1.0970
irintensity: 0.2388 0.4073 0.0926 2.7556 2.0288 0.1894 0.1482 1.7876 0.8782 1.7488 4.0590 5.2632 6.2150 5.2658 3.1837 11.9117 3.8535 1.5426 1.0293 4.8407 14.6869 19.6524 70.8951 8.4802 18.9823 0.4807 4.3517 34.0761 0.3024 38.1283 5.3193 29.5701 104.5984 0.4411 8.9382 13.5019 39.2738 71.3826 11.3267 5.9654 8.1603 55.9720 3.5292 237.6015 14.7962 10.1969 13.0175 10.9652 96.7823 17.3107 165.9848 106.0263 19.1716 126.4841 355.2663 166.0538 41.6367 67.7641 15.8988 25.3822 21.3314 9.5349 2.5785 13.3968 22.8993 3.0752
temp: 298.150 k
press: 1.00000 atm
elementType: 6 6 6 6 6 6 6 6 1 1 1 7 1 5 6 1 1 1 6 1 1 1 1 1
symmnumber: 1
zpe: 517846.6 jmol-1
zpe.correction: 0.197237 hartree
zpe.thermalcorrener: 0.208417 hartree
zpe.thermalcorrenthalpy: 0.209361 hartree
zpe.thermalcorrgfe: 0.160441 hartree
zpe.sumelectzpe: -467.652432 hartree
zpe.sumelectthermal: -467.641253 hartree
zpe.sumelectthermalent: -467.640309 hartree
zpe.sumelectthermalfe: -467.689228 hartree
dipole: 0.5795 2.4213 -0.0402
dipole: 2.4900
quadrupole: -66.4443 -68.6549 -76.0679
quadrupole: -1.1019 -0.8240 -0.5813
quadrupole: 3.9447 1.7341 -5.6788 -1.1019 -0.8240 -0.5813
hfenergy: -467.8496694 hartree
pointgroup: C01 [X(C10H12B1N1)]
dipole: 0.2279983 0.9526247 -0.0158261 debye
dipolederiv: -1.0392233 1.6584325 0.0589915 1.3287158 -0.8361923 -0.0925649 0.0586348 -0.1142955 -0.1811638 0.3114132 -0.8648047 -0.0345963 -0.1976663 0.6420936 0.0141317 -0.0350716 0.0603347 -0.188398 0.3466767 -0.1313367 -0.0158564 -0.2961801 -0.0056778 0.0201483 -0.0165737 0.009163 0.1162371 -0.1883019 0.0462225 -0.0017624 0.1746724 0.0146658 -0.0117809 -0.001187 -0.0030056 -0.1983469 0.0978227 0.3506652 -0.0133435 -0.0861096 0.5209299 0.0050971 -0.0126699 -0.0268336 -0.097616 0.1155513 -0.2994873 -0.0212428 0.1583839 -0.7695763 -0.0109433 -0.0209867 0.0202558 -0.1985912 0.3349368 -0.3964563 -0.0321679 -0.1513484 0.5299858 0.0109612 -0.0309294 0.0276884 -0.1199318 -0.3600503 0.269082 0.0208435 0.0265244 -0.6444704 -0.0023101 0.019769 -0.0184378 -0.0610033 -0.0220283 -0.1053967 0.0120869 -0.0667038 0.0026043 0.0043205 0.0111498 0.0055667 0.1599224 -0.0955223 0.0955801 0.0174238 0.104413 0.022338 -0.0072329 0.0168906 -0.0061645 0.1571093 -0.0559936 -0.0628333 0.0141922 -0.1022588 0.0243787 0.0069661 0.0143818 0.0044714 0.1483318 -0.8461592 -0.0594837 0.0483315 -0.4453898 -0.3116704 0.0303383 0.0503748 0.0035037 -0.1466448 0.0534181 -0.0574346 0.0081706 -0.0491126 -0.0280046 0.003032 0.0081378 0.0029314 0.1736174 1.1792208 -0.6367019 -0.059521 -0.6892536 1.4027366 0.0484144 -0.0600373 0.0457449 0.3144159 0.6891862 0.1700056 -0.0276231 0.2666107 0.169049 -0.0176911 -0.0277777 -0.0108713 0.2840961 -0.0192994 -0.0241408 0.02117 -0.1400605 0.0048387 -0.0729998 -0.0730327 -0.0952386 -0.0637131 0.0104289 0.0156324 0.0059333 0.1232841 0.012985 -0.0094898 0.0059496 -0.0018876 0.0991867 -0.0135235 -0.0115549 -0.027282 -0.1302758 0.0030485 0.0924509 0.0666829 0.0987971 -0.0701693 0.0521763 0.1542013 0.0053565 0.0472974 -0.062209 -0.0031097 0.0032823 -0.0063014 0.1273013 0.0496303 0.0331514 0.0854895 0.0569573 -0.0646198 -0.0183976 0.1006419 -0.0945907 -0.0572556 -0.0943104 -0.1548566 0.0112737 -0.0089063 -0.0280501 0.0003945 0.0118827 0.009493 0.0859963 0.0255897 0.0446039 -0.0956597 0.059946 -0.0662452 0.0110259 -0.1098278 0.0885748 -0.0322274 -0.4119337 0.1199395 0.0194528 -0.0317373 -0.1332752 0.0024693 0.0196248 -0.0081059 -0.1330385 -0.119705 -0.1530288 0.0003392 0.0481978 -0.3996628 -0.00323 0.0006909 0.0092076 -0.1181145 unknown
polarizability: 200.8103934|-49.9424015|230.7776447|-7.5940371|3.4489944|91.2979529 unknown
InChI: InChI=1/C10H12BN/c1-7-3-4-8-6-10(11)12(2)9(8)5-7/h3-6H,11H2,1-2H3
charge 0 multiplicity 1
24 atoms
C  -1.11618115 -1.23959955 -0.19518409
C  -2.50214687 -1.27206993 -0.09966727
C  -1.83789448 0.89212016 -0.14523207
C  -1.94024798 2.29396472 -0.13768623
C  -3.19589059 2.85839887 -0.05035992
C  -4.34564811 2.02638673 0.02906929
C  -4.25265217 0.65624651 0.02192613
C  -2.97959397 0.06014084 -0.06653426
H  -1.05645581 2.91994848 -0.19864403
H  -5.32069538 2.49832942 0.09709286
H  -5.14357284 0.04074891 0.08334594
N  -0.73048435 0.10610711 -0.22171802
H  -3.08886026 -2.17814328 -0.05950098
B  -0.21146368 -2.45395613 -0.25752972
C  0.61746136 0.62399268 -0.3132599
H  0.85515383 1.23186391 0.56386788
H  1.317776 -0.20595769 -0.36352074
H  0.73266184 1.23601823 -1.21181916
C  -3.3746326 4.35352191 -0.0379817
H  -3.88090009 4.67715219 0.87610438
H  -2.41588341 4.87184851 -0.09684682
H  -3.98939423 4.67848339 -0.8824863
H  0.97902583 -2.37805176 -0.33960926
H  -0.72606771 -3.53172985 -0.22199851
