program: Gaussian 16
title: NH2_H
version: ES64L-G16RevC.01
method: RwB97XD
basis: GenECP
operation: Freq
keyword: #N
keyword: Geom=AllCheck
keyword: Guess=TCheck
keyword: SCRF=Check
keyword: GenChk
keyword: RwB97XD/GenECP
keyword: Freq
converged: YES YES NO YES
title: Mulliken charges:
elementType: C H C N N B C H H H H H C N H H
charge: -0.066491 0.256487 -0.155068 0.004655 -0.193725 -0.092837 -0.448183 0.206061 0.216416 0.174332 -0.012048 -0.066384 0.021541 -0.435832 0.317645 0.273429
chargesum: 0.00000
title: Mulliken charges with hydrogens summed into heavy atoms:
elementType: C C N N B C C N
charge: 0.189996 -0.155068 0.004655 -0.193725 -0.171268 0.148626 0.021541 0.155243
1716.lowfreq: -15.3399 -0.0001 0.0003 0.0005 9.5680 11.3873 111.5229 143.6735 199.7497
frequency: 111.4750 143.6215 199.7259 239.6562 263.5690 287.2782 302.4132 418.2660 492.1726 614.1989 646.5505 662.2276 694.5166 773.7042 823.0354 838.9598 860.2293 996.3496 1015.9067 1081.8340 1139.1842 1153.1470 1185.6288 1234.6642 1274.9829 1339.2375 1432.2582 1455.0920 1488.9139 1500.7466 1516.7700 1576.2197 1620.1585 1680.6892 2554.0280 2633.7845 3057.0244 3132.4517 3170.2015 3272.6280 3586.7571 3683.5924
redmass: 1.1047 2.4551 2.8525 2.0369 1.2728 2.8867 2.3732 1.3516 2.7139 4.3927 2.5054 4.8878 2.2464 2.9725 1.4730 2.5448 1.8076 1.4245 4.7098 1.5838 1.5003 1.3184 1.4759 1.5301 3.1997 4.7318 4.7898 1.3956 1.0823 3.1064 1.2080 3.8567 1.6831 2.4529 1.0590 1.1249 1.0357 1.1040 1.1040 1.0996 1.0495 1.0965
irintensity: 0.2710 3.0941 11.8861 10.3202 40.7314 3.3054 12.0687 5.8802 5.2423 26.2534 52.9442 42.7439 92.1345 152.3593 22.0415 12.5887 21.5799 44.0164 5.7177 50.8774 26.5456 1.4357 9.8133 81.9397 1.3811 85.0249 63.4054 15.2040 21.3322 134.1466 0.4108 132.9627 122.7462 384.9761 254.3486 186.3958 44.6536 12.4547 5.7476 0.0712 31.1646 41.2644
temp: 298.150 k
press: 1.00000 atm
elementType: 6 1 6 7 7 5 6 1 1 1 1 1 6 7 1 1
symmnumber: 1
zpe: 335874.6 jmol-1
zpe.correction: 0.127928 hartree
zpe.thermalcorrener: 0.136085 hartree
zpe.thermalcorrenthalpy: 0.137029 hartree
zpe.thermalcorrgfe: 0.095793 hartree
zpe.sumelectzpe: -346.191450 hartree
zpe.sumelectthermal: -346.183293 hartree
zpe.sumelectthermalent: -346.182348 hartree
zpe.sumelectthermalfe: -346.223585 hartree
dipole: -4.3083 5.1138 -0.6878
dipole: 6.7221
quadrupole: -67.2894 -36.9511 -47.0352
quadrupole: 7.4774 1.7126 2.6698
quadrupole: -16.8642 13.4741 3.3900 7.4774 1.7126 2.6698
hfenergy: -346.3193774 hartree
pointgroup: C01 [X(C4H8B1N3)]
dipole: -1.6950276 2.0119427 -0.2706179 debye
dipolederiv: 0.3210842 -0.5456937 0.3155184 -0.538725 0.5478115 -0.3939559 0.3233029 -0.432318 0.1076021 0.1573426 0.0444008 -0.0270851 0.0211254 0.0829338 -0.0801647 -0.033575 -0.05881 0.0502541 -0.6143478 0.5979089 -0.2089641 0.6206079 -0.9127022 0.5347247 -0.150901 0.4936352 0.0043182 -0.4752828 0.5013828 -0.1453591 0.2648489 -0.7148387 -0.1345314 -0.5329561 0.5474493 -0.6993124 -0.4678635 0.0163588 -0.2723291 0.1805525 -0.5836538 0.1662399 -0.0145104 -0.2419862 -0.6559252 0.7287325 -0.5014518 0.3059185 -0.4596574 1.0154678 -0.2069566 0.3583365 -0.3029632 0.7607032 0.3872241 -0.1981742 -0.0145145 -0.2331979 0.592087 -0.0576002 -0.0258286 -0.059685 0.1451235 0.0446706 0.0228341 0.0528647 0.0610891 0.0010551 0.0377734 0.0178018 0.1184539 -0.0259592 -0.1441403 0.0804196 -0.0007604 -0.0218596 -0.0374214 0.0215558 0.0025297 0.0161429 0.0928203 0.0615194 -0.0285951 -0.0727418 0.0335448 0.0058701 -0.0290446 -0.0384728 -0.107101 0.000926 -0.1621251 0.0171685 -0.0491617 -0.0428724 -0.1372746 -0.1017373 -0.1211515 0.0299137 -0.3616371 -0.1766236 0.0672267 -0.0023152 0.1164399 -0.3478092 0.014653 0.0541433 -0.0913431 -0.1297517 0.4908269 -0.1435607 0.5358021 -0.0570639 0.4805223 0.0878756 0.6378253 -0.1484102 1.5185961 -0.4682196 -0.0356903 -0.2685338 0.0688489 -0.4897937 0.3700739 -0.5114953 0.2975871 -1.3602707 0.2105267 0.0414696 -0.0904093 0.0341926 0.1709217 -0.0668761 -0.0363504 0.0047882 0.3197324 0.1066756 0.0639959 -0.0579298 -0.0478738 0.3268245 -0.1620294 0.0713015 -0.0653535 0.2327806 unknown
polarizability: 85.5534678|-28.2118327|107.2482779|23.3915626|-7.3000686|102.6835186 unknown
InChI: InChI=1/C4H8BN3/c1-8-2-3(5)7-4(8)6/h2H,5-6H2,1H3
charge 0 multiplicity 1
16 atoms
C  2.70342162 1.61168218 1.06395054
H  2.82134482 2.18126944 1.97282499
C  3.18540975 0.36834532 0.70587712
N  1.98037571 2.08517959 0.01118148
N  2.72979485 0.07575938 -0.58826136
B  4.05300595 -0.52401562 1.56935701
C  1.30233985 3.36180954 -0.09845756
H  1.55006525 3.82803157 -1.05346195
H  0.21892115 3.23774354 -0.02540037
H  1.63705095 4.00962785 0.70986306
H  4.35630467 -0.14838737 2.66675594
H  4.43656323 -1.58599876 1.17746057
C  2.0294314 1.10685456 -0.9564403
N  1.44756714 1.31161908 -2.19622799
H  1.51645954 0.48366882 -2.77087815
H  0.49774866 1.65664788 -2.17027965
