program: Gaussian 16
title: OCHO_H
version: ES64L-G16RevC.01
method: RwB97XD
basis: GenECP
operation: Freq
keyword: #N
keyword: Geom=AllCheck
keyword: Guess=TCheck
keyword: SCRF=Check
keyword: GenChk
keyword: RwB97XD/GenECP
keyword: Freq
converged: YES YES YES YES
title: Mulliken charges:
elementType: C H C N N B C H H H H H C O C O H
charge: -0.097780 0.268211 -0.101367 0.040636 -0.125125 -0.084080 -0.418848 0.220133 0.176303 0.222480 -0.002860 -0.059288 -0.016725 -0.042485 0.061547 -0.248479 0.207726
chargesum: -0.00000
title: Mulliken charges with hydrogens summed into heavy atoms:
elementType: C C N N B C C O C O
charge: 0.170430 -0.101367 0.040636 -0.125125 -0.146227 0.200069 -0.016725 -0.042485 0.269273 -0.248479
chargesum: 0.00000
1716.lowfreq: -13.1475 -11.6317 -0.0006 0.0002 0.0007 6.3811 52.1820 105.1308 125.8208
frequency: 52.0992 105.0861 125.8194 162.0432 202.2918 225.6417 244.0400 321.4119 332.2282 415.1455 535.6034 594.3542 637.2148 664.5269 706.2028 816.9787 843.1841 859.4786 868.8371 1000.5741 1014.2735 1056.4842 1089.8061 1140.9442 1153.8768 1181.6907 1229.2728 1245.7289 1337.8787 1393.4077 1419.4009 1453.0357 1489.1467 1491.6433 1519.1274 1568.5885 1630.7293 1846.3608 2564.8995 2647.5324 3072.4477 3115.5195 3155.1245 3178.5219 3276.1638
redmass: 6.1912 2.2171 1.6636 2.6658 2.5826 4.3669 2.4897 2.8765 2.0874 1.8347 4.0497 5.2718 5.1573 3.4276 9.5419 3.5947 1.5791 1.7278 6.6220 1.4281 5.0185 1.6183 1.5861 6.4329 1.3218 1.3292 2.0489 2.6770 5.5936 1.4492 2.6537 1.6849 1.7879 1.3281 1.1846 4.1502 8.9133 9.6005 1.0582 1.1259 1.0334 1.0966 1.1062 1.1052 1.0999
irintensity: 3.4856 4.1225 3.1732 1.2267 13.4024 0.7847 1.0620 8.7075 5.9912 1.8753 4.9407 11.4387 8.9080 5.4398 3.8522 30.6623 40.8898 35.5497 6.8169 45.2988 7.0621 0.0450 64.3041 386.3288 5.7591 34.9620 181.4461 106.1880 47.6898 67.4692 83.3805 13.0179 79.2551 50.1701 12.5106 88.4131 320.2712 329.5804 231.0383 168.3486 28.8214 39.3210 6.0089 4.9755 0.2937
temp: 298.150 k
press: 1.00000 atm
elementType: 6 1 6 7 7 5 6 1 1 1 1 1 6 8 6 8 1
symmnumber: 1
zpe: 328879.5 jmol-1
zpe.correction: 0.125264 hartree
zpe.thermalcorrener: 0.134877 hartree
zpe.thermalcorrenthalpy: 0.135822 hartree
zpe.thermalcorrgfe: 0.090052 hartree
zpe.sumelectzpe: -479.377225 hartree
zpe.sumelectthermal: -479.367611 hartree
zpe.sumelectthermalent: -479.366667 hartree
zpe.sumelectthermalfe: -479.412437 hartree
dipole: -3.6714 4.9433 -0.1873
dipole: 6.1604
quadrupole: -78.3944 -48.7525 -53.3106
quadrupole: 4.7654 4.8286 2.5852
quadrupole: -18.2419 11.4000 6.8419 4.7654 4.8286 2.5852
hfenergy: -479.5024887 hartree
pointgroup: C01 [X(C5H7B1N2O2)]
dipole: -1.4444371 1.9448271 -0.0736704 debye
dipolederiv: 0.2129871 -0.4151323 0.2784474 -0.3804315 0.5256986 -0.3975997 0.3139627 -0.3930003 0.2210241 0.1657626 0.0313747 -0.019414 0.0213203 0.068756 -0.068747 -0.0252175 -0.0413405 0.0631522 -0.4639179 0.4537063 -0.2395099 0.4454763 -0.8233039 0.5706195 -0.2111071 0.532723 -0.2641883 -0.3895395 0.5047897 -0.2247575 0.2072221 -0.6739591 -0.0252447 -0.3715466 0.5096771 -0.6732377 -0.3070233 0.0479739 -0.1097858 0.1196831 -0.5835051 0.0403907 0.0676311 -0.1806703 -0.4980934 0.6341708 -0.4134987 0.3277175 -0.3502005 1.0020954 -0.2852683 0.3451279 -0.370219 0.880455 0.3156142 -0.2017196 0.0285611 -0.1776078 0.567855 -0.1218762 0.0101704 -0.0835169 0.1626851 -0.0378446 0.0445028 -0.0775739 -0.0347406 -0.0029472 0.0013436 -0.0899263 0.0312437 0.071238 0.1013063 0.0342506 -0.0181757 0.0394748 0.0310634 0.0034501 0.0260488 -0.0872396 -0.046705 -0.0000409 -0.0284231 0.0598486 0.0518114 -0.0409631 0.0635293 0.0311236 0.1002253 0.0438694 -0.1523135 0.0131872 -0.0429124 -0.0410356 -0.1406139 -0.1086454 -0.0859021 0.020608 -0.3511369 -0.1639503 0.0546793 -0.0090416 0.0937506 -0.3438469 0.040617 0.0368382 -0.0690172 -0.1216658 0.3282534 -0.2430061 0.4035606 -0.0742146 0.6102176 0.2472032 0.2267054 -0.1424491 1.5382528 -0.6120327 -0.1563699 -0.0214563 -0.187897 -0.5812978 0.4878571 0.0554655 0.6352656 -2.0188404 1.2402807 0.7817281 -0.6263161 0.6182745 0.9614491 -0.7588379 -0.1216478 -0.4608001 1.7312782 -0.9139031 -0.4811502 0.3680485 -0.3231379 -0.6691151 0.2978226 -0.1278286 -0.0063412 -0.672294 0.0421908 -0.0268928 -0.0772403 -0.0277477 0.0924172 0.0133861 -0.0798977 0.0048514 -0.0657936 unknown
polarizability: 83.5083945|-17.5897018|111.0989739|18.18237|-13.7867212|116.9704364 unknown
InChI: InChI=1/C5H7BN2O2/c1-8-2-4(6)7-5(8)10-3-9/h2-3H,6H2,1H3
charge 0 multiplicity 1
17 atoms
C  2.65939623 1.53810241 1.06912667
H  2.74337564 2.17398524 1.93679268
C  3.10250736 0.24667862 0.84744881
N  2.03372517 1.95485196 -0.06251024
N  2.7394855 -0.12426197 -0.45350015
B  3.8541834 -0.6297595 1.83451349
C  1.44144336 3.25501596 -0.32833633
H  0.46796951 3.12608776 -0.80156068
H  1.30860385 3.77566528 0.61801945
H  2.09283417 3.84072048 -0.97836494
H  4.10371265 -0.19112361 2.920333
H  4.19260962 -1.73599536 1.54056791
C  2.13126953 0.90319304 -0.93203111
O  1.54226046 0.96256292 -2.16535869
C  2.20158244 1.63552567 -3.14193585
O  3.20834673 2.25246017 -2.98623272
H  1.64779627 1.52404563 -4.07948462
