program: Gaussian 16
title: NO2_H
version: ES64L-G16RevC.01
method: RwB97XD
basis: GenECP
operation: Freq
keyword: #N
keyword: Geom=AllCheck
keyword: Guess=TCheck
keyword: SCRF=Check
keyword: GenChk
keyword: RwB97XD/GenECP
keyword: Freq
converged: YES YES YES YES
title: Mulliken charges:
elementType: C H C N N B C H H H H H C N O O
charge: 0.029229 0.303018 -0.074890 0.021989 -0.027576 -0.078768 -0.435607 0.234792 0.236486 0.158564 0.011494 -0.049357 -0.052388 -0.252084 -0.040808 0.015905
chargesum: -0.00000
title: Mulliken charges with hydrogens summed into heavy atoms:
elementType: C C N N B C C N O O
charge: 0.332247 -0.074890 0.021989 -0.027576 -0.116630 0.194235 -0.052388 -0.252084 -0.040808 0.015905
1716.lowfreq: -12.5275 -10.1352 -0.0004 -0.0002 0.0005 13.0931 32.1888 141.6857 169.7348
frequency: 30.5807 141.6794 169.7305 203.6066 224.2332 288.2226 301.2926 353.5617 382.2267 434.2973 571.1761 621.4733 641.0013 689.7133 763.1274 768.8491 853.4927 871.7498 891.9305 1004.8929 1026.5431 1100.1898 1155.5564 1184.6696 1205.6412 1243.3769 1316.0863 1395.7771 1431.1513 1463.0399 1482.4959 1488.7181 1516.4775 1538.6246 1592.6375 1661.9629 2579.1585 2668.6879 3092.8889 3187.6202 3189.6441 3275.2846
redmass: 8.5132 4.0108 3.0461 3.6457 1.0789 3.4597 3.5041 1.2396 4.0899 8.9249 4.5639 4.5375 4.1289 5.7140 12.3402 5.8135 1.6270 1.4565 7.6663 1.4367 4.7789 1.5622 1.3217 1.4651 3.6479 1.4750 7.0816 4.8188 6.0232 2.4929 1.8202 1.0813 1.2928 4.8731 5.4067 13.1156 1.0576 1.1268 1.0318 1.1069 1.1070 1.1000
irintensity: 2.1772 0.1014 0.1950 2.3704 0.0506 2.8478 0.4522 0.4181 0.4973 1.4179 0.0598 10.7233 21.4251 2.0670 0.4256 29.4733 5.7155 26.8449 110.2247 47.6346 7.0134 7.1346 0.0139 23.3680 4.6947 96.4193 235.9727 80.0354 156.4208 127.7273 2.6813 14.8545 76.1668 45.6894 286.0739 355.0596 219.4085 136.9804 16.8405 3.7091 5.4786 1.4624
temp: 298.150 k
press: 1.00000 atm
elementType: 6 1 6 7 7 5 6 1 1 1 1 1 6 7 8 8
symmnumber: 1
zpe: 299084.8 jmol-1
zpe.correction: 0.113915 hartree
zpe.thermalcorrener: 0.122942 hartree
zpe.thermalcorrenthalpy: 0.123887 hartree
zpe.thermalcorrgfe: 0.079164 hartree
zpe.sumelectzpe: -495.325691 hartree
zpe.sumelectthermal: -495.316664 hartree
zpe.sumelectthermalent: -495.315719 hartree
zpe.sumelectthermalfe: -495.360442 hartree
dipole: -0.3454 5.0931 4.8060
dipole: 7.0112
quadrupole: -61.1935 -44.9642 -70.0465
quadrupole: 12.4652 5.7073 5.4974
quadrupole: -2.4588 13.7705 -11.3118 12.4652 5.7073 5.4974
hfenergy: -495.439606 hartree
pointgroup: C01 [X(C4H6B1N3O2)]
dipole: -0.135894 2.0037951 1.8908309 debye
dipolederiv: 0.1299376 -0.3643691 -0.0401101 -0.2284547 0.4808859 0.0674261 0.1071265 -0.2284118 -0.050951 0.1571217 0.0270272 -0.0118297 0.0178022 0.0868099 -0.0583918 -0.0226413 -0.0395068 0.0832884 -0.5148034 0.4081896 -0.2957769 0.3116369 -0.6530817 0.1511401 -0.4008024 0.3623239 -0.6473122 -0.345848 0.4171209 -0.0350938 0.3022639 -0.6566495 0.0658758 -0.1533959 0.3144976 -0.106353 -0.115812 0.0101896 0.3300613 -0.0258254 -0.4748189 -0.2872692 0.2850455 -0.2070652 0.1335391 0.7692719 -0.4198577 0.375065 -0.4315983 0.9489632 -0.3208434 0.3630876 -0.2951142 0.8527888 0.3053934 -0.1592019 0.0048467 -0.1788979 0.5578833 -0.0208829 -0.0173752 0.0205796 0.2015635 0.0388947 0.0121353 0.0656275 0.040109 -0.0045597 0.0184962 0.0456896 0.0772958 0.0217321 -0.0434895 0.0332376 -0.0079804 -0.0310095 -0.0099865 -0.0040433 -0.0255794 0.0118591 0.1078605 0.083283 -0.0084532 -0.0696728 0.034755 0.0325549 -0.0110706 -0.0232571 -0.1018641 -0.0453765 -0.1652622 0.0106766 -0.0478703 -0.0388627 -0.1345846 -0.0816219 -0.1025874 0.0252084 -0.3328772 -0.1676143 0.0450908 -0.0102134 0.0960386 -0.2983567 0.0353518 0.0452868 -0.0743292 -0.1243557 -0.0419791 0.0332632 -0.5569366 0.1630792 0.3683125 0.4953888 -0.4188175 0.2197723 -0.4402564 0.9190505 -0.6562534 0.6806443 -0.6097573 1.7259683 0.3645483 0.7327994 0.26099 2.160628 -0.6526184 0.5037607 -0.2586972 0.472061 -1.0806377 0.0956864 -0.2961368 0.1640062 -0.7235933 -0.355526 0.1074438 -0.1220635 0.1066601 -0.8887027 -0.5097905 -0.1184423 -0.5102417 -1.0903251 unknown
polarizability: 85.8231127|-29.8830939|113.1152247|30.6519664|-2.1656576|120.9594593 unknown
InChI: InChI=1/C4H6BN3O2/c1-7-2-3(5)6-4(7)8(9)10/h2H,5H2,1H3
charge 0 multiplicity 1
16 atoms
C  2.70166844 1.65224322 1.01728971
H  2.82662531 2.23133089 1.91943792
C  3.1801208 0.39247632 0.67931469
N  1.98315542 2.12492889 -0.0249593
N  2.74098186 0.09694451 -0.59801166
B  4.04078513 -0.53003428 1.54111243
C  1.31380424 3.42499599 -0.057357
H  1.69874169 4.02516046 -0.87860287
H  0.24152123 3.29259866 -0.18238234
H  1.51903842 3.9182888 0.89079868
H  4.35954848 -0.16546692 2.63416785
H  4.38681216 -1.5929991 1.12903514
C  2.05115172 1.1274543 -0.96800198
N  1.40611123 1.22128112 -2.26439581
O  0.76449508 2.2351525 -2.49425547
O  1.54544955 0.29487447 -3.02676478
