program: Gaussian 16
title: h_naphthalene
version: ES64L-G16RevC.02
method: RwB97XD
basis: GenECP
operation: Freq
keyword: #N
keyword: Geom=AllCheck
keyword: Guess=TCheck
keyword: SCRF=Check
keyword: GenChk
keyword: RwB97XD/GenECP
keyword: Freq
converged: YES YES YES YES
title: Mulliken charges:
elementType: C C C C C C H C C H H C C H H H B N C H H H C H H H H H
charge: -0.326079 0.097296 0.058398 0.191238 -0.368488 -0.348055 0.209319 0.021142 -0.054136 0.188181 0.235514 -0.488626 -0.461179 0.202058 0.214386 0.243283 -0.181134 0.072606 -0.300176 0.161229 0.203406 0.228934 -0.328926 0.203165 0.169449 0.227352 -0.037116 -0.033043
chargesum: 0.00000
title: Mulliken charges with hydrogens summed into heavy atoms:
elementType: C C C C C C C C C C B N C C
charge: -0.116760 0.097296 0.058398 0.191238 -0.180307 -0.112541 0.021142 0.147923 -0.274240 -0.217896 -0.251293 0.072606 0.293392 0.271041
chargesum: -0.00000
1716.lowfreq: -10.8797 0.0003 0.0004 0.0006 8.2064 8.8687 35.0003 150.1531 172.1083
frequency: 32.6518 150.1519 172.1032 215.1398 279.1990 286.8781 315.1107 318.0281 331.3694 383.0711 431.9168 473.4607 484.1944 499.8605 519.7130 538.9542 573.2288 606.4298 623.2724 680.6839 704.0345 761.7846 791.3086 802.6381 817.7462 822.1719 881.7166 920.5485 936.0431 938.3386 968.9328 1004.1723 1007.1723 1012.4380 1044.9312 1053.0760 1068.8169 1084.3979 1135.3192 1136.8478 1175.7638 1195.0037 1209.8562 1223.7081 1225.8601 1246.2376 1258.6627 1270.6846 1305.1202 1375.9207 1405.1057 1448.1055 1456.7170 1474.5444 1480.5038 1484.8363 1490.5602 1506.3848 1509.3336 1516.5501 1554.2202 1658.3983 1662.6936 1701.9102 2450.9513 2484.0294 3062.4066 3064.9013 3153.4575 3155.2060 3172.8613 3179.7357 3182.4723 3184.9945 3185.2839 3198.0022 3200.3017 3211.4959
redmass: 2.7708 3.0587 3.5972 3.3170 2.5106 1.0810 2.4035 2.8059 1.1777 2.9019 3.6482 3.0958 3.2837 4.6718 4.9660 4.7638 4.3884 3.2468 5.1761 3.3308 3.9460 1.3645 3.9528 1.6861 4.9649 1.6968 2.6188 1.4050 2.2230 1.9073 1.2819 1.3255 3.7195 1.3325 2.9316 1.5823 1.7354 1.9248 1.4224 1.3583 1.3588 1.1832 1.2133 2.6529 1.6177 1.9176 1.7382 2.0018 2.2757 3.2010 3.3312 1.1517 2.1951 4.3479 1.1951 1.0419 1.0461 1.1288 1.2869 1.7561 4.2590 5.8208 7.7525 7.4341 1.0588 1.1155 1.0341 1.0354 1.1033 1.1025 1.0868 1.1061 1.1065 1.0875 1.0908 1.0921 1.0970 1.0970
irintensity: 4.7231 0.2066 3.9140 0.7424 2.0466 0.0073 0.2081 0.8105 0.0624 9.8095 5.9721 3.5143 3.1284 1.4712 1.4358 1.2777 1.4809 0.9482 13.9037 0.3394 30.7052 2.4883 6.4888 63.9758 1.6278 64.9047 1.8081 1.3804 8.8971 6.2609 0.3478 0.1835 19.6053 1.1775 16.5377 15.0079 20.9571 14.0605 43.9332 31.3533 5.0398 6.1283 37.6487 14.5113 2.6163 0.1508 0.5977 3.1460 6.2134 8.5319 29.5258 4.2825 3.2541 15.3336 1.3429 0.0834 11.9938 13.7904 29.0701 17.8444 4.3095 13.9047 25.2319 16.6219 278.1044 228.2419 14.2397 45.9652 2.0109 26.0093 6.2161 3.5856 14.5654 1.4151 27.0395 18.1430 42.7374 15.7017
temp: 298.150 k
press: 1.00000 atm
elementType: 6 6 6 6 6 6 1 6 6 1 1 6 6 1 1 1 5 7 6 1 1 1 6 1 1 1 1 1
symmnumber: 1
zpe: 619250.7 jmol-1
zpe.correction: 0.235860 hartree
zpe.thermalcorrener: 0.246955 hartree
zpe.thermalcorrenthalpy: 0.247899 hartree
zpe.thermalcorrgfe: 0.199304 hartree
zpe.sumelectzpe: -545.041967 hartree
zpe.sumelectthermal: -545.030872 hartree
zpe.sumelectthermalent: -545.029927 hartree
zpe.sumelectthermalfe: -545.078523 hartree
dipole: -3.9594 -2.5582 0.2063
dipole: 4.7185
quadrupole: -58.3750 -68.9548 -87.2648
quadrupole: 14.3933 -0.8580 0.3630
quadrupole: 13.1566 2.5767 -15.7333 14.3933 -0.8580 0.3630
hfenergy: -545.2778267 hartree
pointgroup: C01 [X(C12H14B1N1)]
dipole: -1.5577496 -1.0064691 0.0811651 debye
polarizability: 222.9684475|10.2485689|222.0376466|-13.7579722|2.0033026|116.1790997 unknown
InChI: InChI=1/C12H14BN/c1-14(2)11-8-4-6-9-5-3-7-10(13-14)12(9)11/h3-8H,13H2,1-2H3
charge 0 multiplicity 1
28 atoms
C  -5.41628225 -0.7879264 0.18552516
C  -4.06253521 -0.76472206 0.00852312
C  -3.34461232 0.43880618 -0.04419377
C  -4.00327734 1.67788895 0.0785081
C  -5.41061406 1.65045575 0.26296893
C  -6.08635259 0.45570299 0.3158828
H  -5.98047537 -1.71288323 0.22589535
C  -1.94949101 0.28058994 -0.22459681
C  -3.19120652 2.83703717 0.00642033
H  -5.95348468 2.58473564 0.36323557
H  -7.16103818 0.45412711 0.45843145
C  -1.83464724 2.70350402 -0.17476125
C  -1.20716115 1.43631449 -0.28987484
H  -3.64359672 3.81922641 0.09434557
H  -1.22039811 3.5967972 -0.22947653
H  -0.13085552 1.39783618 -0.42664474
B  -1.60882784 -1.28212407 -0.2808229
N  -3.17852592 -1.9261575 -0.16709432
C  -3.28612068 -2.84958555 0.9892902
H  -4.29489071 -3.26449122 1.05300963
H  -2.56262013 -3.65374717 0.85982326
H  -3.0525067 -2.29984133 1.89890956
C  -3.53333138 -2.64656426 -1.41687463
H  -2.83019579 -3.46648708 -1.55804369
H  -4.55298116 -3.03411212 -1.35357829
H  -3.45115941 -1.95495017 -2.25342726
H  -1.14400425 -1.68252312 -1.32501985
H  -0.99944379 -1.6951747 0.68175863
