program: Gaussian 16
title: H_H
version: ES64L-G16RevC.01
method: RwB97XD
basis: GenECP
operation: Freq
keyword: #N
keyword: Geom=AllCheck
keyword: Guess=TCheck
keyword: SCRF=Check
keyword: GenChk
keyword: RwB97XD/GenECP
keyword: Freq
converged: YES YES YES YES
title: Mulliken charges:
elementType: C H C N N B C H H H H H C H
charge: -0.229636 0.233306 -0.098703 0.032914 -0.158455 -0.064092 -0.391169 0.162247 0.212940 0.195052 -0.004757 -0.055707 -0.061051 0.227113
chargesum: 0.00000
title: Mulliken charges with hydrogens summed into heavy atoms:
elementType: C C N N B C C
charge: 0.003670 -0.098703 0.032914 -0.158455 -0.124557 0.179070 0.166062
1716.lowfreq: -11.8277 -0.0002 0.0006 0.0007 8.1794 23.4476 72.2035 152.9996 245.0818
frequency: 71.4868 152.9865 245.0772 270.3317 363.3454 388.7240 618.4174 639.3335 701.6217 738.4743 837.3054 843.7287 873.2260 1001.6307 1003.5839 1070.2623 1092.6746 1152.6449 1170.0453 1229.4723 1264.9341 1338.9052 1384.7198 1455.9035 1470.7394 1492.4718 1508.1178 1546.6241 1595.6279 2559.4752 2640.1443 3068.3285 3148.7353 3168.5035 3247.4324 3271.3826
redmass: 1.0977 2.5962 2.3920 3.9197 1.0803 2.6045 4.2441 2.6711 4.3106 4.3373 1.4387 1.4794 1.4217 1.4395 4.2063 3.2054 1.6346 1.3230 1.3470 1.4522 1.4715 4.5131 4.2103 3.0144 1.6291 1.0381 1.3464 2.8502 4.1669 1.0585 1.1254 1.0334 1.1061 1.1048 1.0979 1.0999
irintensity: 0.1172 1.1341 0.2107 0.2780 0.5808 0.6159 4.5716 22.1498 3.7371 30.8625 5.1786 27.1986 38.9607 45.5200 11.6869 15.3255 9.6419 3.2632 31.1998 71.5727 45.2712 24.4219 66.8863 7.1156 14.1524 14.6778 59.3583 15.3036 188.7723 233.7872 174.8080 43.6059 11.5427 7.7899 1.7492 0.1980
temp: 298.150 k
press: 1.00000 atm
elementType: 6 1 6 7 7 5 6 1 1 1 1 1 6 1
symmnumber: 1
zpe: 290850.6 jmol-1
zpe.correction: 0.110779 hartree
zpe.thermalcorrener: 0.117594 hartree
zpe.thermalcorrenthalpy: 0.118538 hartree
zpe.thermalcorrgfe: 0.079974 hartree
zpe.sumelectzpe: -290.842104 hartree
zpe.sumelectthermal: -290.835289 hartree
zpe.sumelectthermalent: -290.834345 hartree
zpe.sumelectthermalfe: -290.872909 hartree
dipole: -2.7627 5.9039 0.1510
dipole: 6.5200
quadrupole: -56.3048 -28.2138 -41.8269
quadrupole: 10.4847 1.0932 0.1182
quadrupole: -14.1897 13.9014 0.2883 10.4847 1.0932 0.1182
hfenergy: -290.9528831 hartree
pointgroup: C01 [X(C4H7B1N2)]
dipole: -1.0869244 2.3227641 0.0594044 debye
dipolederiv: 0.2176425 -0.4145784 0.1883315 -0.3933082 0.5261553 -0.2671556 0.2284059 -0.3500689 0.0809302 0.1666331 0.0290797 -0.0227648 0.0208853 0.0806806 -0.0733504 -0.0319348 -0.0517098 0.0563382 -0.5213306 0.5158253 -0.1845499 0.4895098 -0.8691879 0.3880948 -0.2133106 0.4579251 -0.1946244 -0.4049253 0.4259757 -0.0985798 0.290305 -0.7632161 -0.0133362 -0.3160278 0.4259373 -0.4241243 -0.3161627 -0.0023968 0.0532099 0.0599946 -0.5362314 -0.0886083 0.1138396 -0.230785 -0.3152927 0.686152 -0.4587833 0.27585 -0.4116367 1.0315598 -0.2034638 0.331447 -0.315192 0.7774484 0.3578252 -0.1925799 -0.0250741 -0.2239806 0.6446374 -0.0408628 -0.0070231 -0.0610051 0.1760704 0.0772377 0.0491923 -0.0230646 0.0243562 0.0450686 -0.0398564 -0.0699668 0.0573156 -0.0702792 -0.0511313 0.0907145 0.0690855 0.0211397 -0.0285917 0.0465506 0.1122139 -0.0234708 0.0283183 -0.0164808 -0.0834335 -0.0421609 0.0195838 -0.0830068 -0.0105429 -0.0320877 -0.0532095 0.0874308 -0.1648867 0.0145178 -0.0466922 -0.0387403 -0.1364077 -0.0895109 -0.1074172 0.0356276 -0.3502029 -0.1663622 0.0544866 0.0015914 0.0979712 -0.3400829 0.0077984 0.0492053 -0.0929097 -0.1294916 0.0252044 -0.078974 -0.0717925 -0.0128308 0.3493596 0.3441784 0.0125288 0.174936 0.2465517 0.1105848 0.050954 -0.0733896 0.0567509 0.0792631 0.0400651 -0.0698727 0.0266091 0.0309271 unknown
polarizability: 71.4760742|-24.8890453|99.4300945|16.6536649|-5.1837902|85.8797934 unknown
InChI: InChI=1/C4H7BN2/c1-7-2-4(5)6-3-7/h2-3H,5H2,1H3
charge 0 multiplicity 1
14 atoms
C  2.68231123 1.64167938 1.08259647
H  2.80935068 2.19635756 1.99980119
C  3.12489866 0.38001209 0.71807323
N  1.9983244 2.14795166 0.02842332
N  2.69204787 0.12876097 -0.58617038
B  3.93987317 -0.57457187 1.5740232
C  1.32867698 3.43485057 -0.04437588
H  1.00669509 3.60675371 -1.07061457
H  0.45541721 3.44872694 0.60948461
H  2.01546159 4.2299766 0.24654624
H  4.25164677 -0.24155125 2.68194336
H  4.26971768 -1.6442057 1.15772257
C  2.03500842 1.18846307 -0.95241392
H  1.55647417 1.3470024 -1.90899712
