program: Gaussian 16
title: h_xanthene
version: ES64L-G16RevC.02
method: RwB97XD
basis: GenECP
operation: Freq
keyword: #N
keyword: Geom=AllCheck
keyword: Guess=TCheck
keyword: SCRF=Check
keyword: GenChk
keyword: RwB97XD/GenECP
keyword: Freq
converged: YES YES YES YES
title: Mulliken charges:
elementType: C C C C C C H H H C O C H H H C H H H C C C C C H C H H B N C H H H C H H H H H
charge: 0.411041 -0.290778 -0.740826 -0.224093 0.373383 0.010511 0.245721 0.238854 0.176474 -0.161317 -0.037075 -0.441225 0.169452 0.166684 0.199745 -0.773170 0.179753 0.187048 0.188270 0.634166 -0.117454 -0.332160 -0.361476 -0.522697 0.152096 -0.019835 0.247923 0.182867 -0.196213 0.200203 -0.456200 0.157219 0.178636 0.178768 -0.347060 0.176756 0.150014 0.166260 0.055115 -0.005381
chargesum: -0.00000
title: Mulliken charges with hydrogens summed into heavy atoms:
elementType: C C C C C C C O C C C C C C C C B N C C
charge: 0.411041 -0.045057 -0.501972 -0.047619 0.373383 0.010511 -0.161317 -0.037075 0.094657 -0.218098 0.634166 -0.117454 -0.180064 -0.361476 -0.274774 0.163033 -0.146479 0.200203 0.058423 0.145970
1716.lowfreq: -13.6187 -2.2141 -0.0004 -0.0003 0.0005 3.8683 44.2123 50.3401 74.2482
frequency: 44.1855 50.3026 74.1752 94.3665 135.3302 154.6147 157.3326 182.6662 201.0843 223.7033 249.9209 264.0617 287.3684 295.3666 300.6852 307.6653 313.8012 332.8682 351.4035 360.8923 381.6641 396.4624 437.4061 447.4450 496.7697 517.4091 544.6528 556.6482 563.3336 579.2653 598.3028 606.5580 654.9241 685.1894 737.1290 763.5888 783.1949 817.6149 821.8415 833.6528 846.5660 860.0453 900.1321 908.5574 921.7659 952.5127 963.8990 989.7361 993.0808 1008.9464 1018.5146 1029.2060 1033.3712 1084.3419 1113.8480 1117.4840 1125.7789 1150.9346 1169.6258 1175.6977 1186.2810 1194.3379 1200.0637 1224.3611 1235.4829 1254.8876 1277.8283 1280.7307 1294.9598 1307.5612 1315.2830 1340.6548 1346.8839 1381.7376 1402.9092 1424.5318 1446.4056 1461.7775 1474.0316 1483.0287 1487.4367 1491.0207 1495.3036 1503.4352 1505.4226 1512.5512 1515.6861 1518.9533 1525.3090 1539.5347 1644.2232 1654.7215 1661.4410 1682.2149 2563.6404 2654.9185 2960.8581 2971.8057 3038.9588 3055.0387 3087.1804 3094.3561 3119.9504 3128.3386 3131.7309 3136.2933 3137.3629 3171.5350 3189.2161 3194.6540 3205.0194 3219.7458 3222.4148 3228.3953
redmass: 4.0999 3.6046 3.1514 3.2738 3.2008 2.6654 2.8018 1.6003 2.0672 2.2485 1.2675 2.2729 1.7213 1.8398 1.3821 2.0347 2.2631 2.1374 2.2517 2.2980 4.1148 2.6430 4.1104 3.2897 4.1069 4.2775 5.2077 3.4856 3.9952 3.9721 3.9398 4.2051 4.6048 6.0449 3.4144 1.5823 1.9263 2.2784 3.4321 3.7602 1.9999 3.5977 4.4172 1.4843 2.9427 1.6410 1.3586 2.2728 1.3249 1.3744 1.4323 1.3477 2.1653 1.4327 1.8623 2.1333 1.3811 1.7845 2.2939 1.4757 2.7510 1.3092 1.3085 1.6726 2.0445 2.8381 3.0505 3.1010 2.3198 2.3592 2.9725 5.8876 6.0208 3.0627 1.2371 1.2405 1.1731 3.1565 1.2108 1.0486 1.1945 1.0453 1.1151 1.3391 1.0636 1.6969 1.6108 1.2093 1.4320 2.1391 5.5698 7.1726 6.7149 8.1019 1.0596 1.1227 1.0571 1.0572 1.0343 1.0366 1.0761 1.0821 1.1034 1.1031 1.1013 1.1040 1.1029 1.0989 1.0877 1.0882 1.0917 1.0956 1.0913 1.0946
irintensity: 1.1070 0.8206 0.2439 2.5054 1.0453 0.3235 0.2374 0.9002 0.3189 1.5389 0.0625 0.3669 0.5258 2.1234 0.1111 2.5380 0.4052 2.2103 1.5188 0.6543 2.7052 0.8427 3.9944 0.1142 2.3223 4.4860 13.0795 2.9707 3.1078 3.5539 1.6206 0.4368 2.1125 1.5982 7.0770 50.6808 57.4467 11.4043 21.7819 2.4449 17.6815 3.3210 21.6902 1.7198 7.8257 4.4993 1.9664 27.9044 1.1806 21.6811 23.1925 5.0872 60.3532 17.6432 25.8428 27.7238 3.4361 23.7051 8.9638 25.7123 29.2864 25.6466 8.9763 16.0711 0.6986 30.0603 59.5867 387.3120 109.0051 106.8541 23.9051 67.4222 1.1182 86.2688 12.0032 12.4430 20.4812 406.9281 9.6819 1.1143 46.8212 17.2719 7.8511 5.8594 40.2374 4.7028 15.9925 2.3177 18.3067 136.0220 67.4608 119.1910 59.9143 5.6027 268.7429 146.7261 105.1361 159.7388 32.9594 24.4528 34.9581 41.6686 25.9553 21.9493 38.7318 24.8935 28.2312 5.7581 3.3111 9.6603 12.7730 20.8940 9.4629 14.3289
temp: 298.150 k
press: 1.00000 atm
elementType: 6 6 6 6 6 6 1 1 1 6 8 6 1 1 1 6 1 1 1 6 6 6 6 6 1 6 1 1 5 7 6 1 1 1 6 1 1 1 1 1
symmnumber: 1
zpe: 877767.7 jmol-1
zpe.correction: 0.334324 hartree
zpe.thermalcorrener: 0.352529 hartree
zpe.thermalcorrenthalpy: 0.353473 hartree
zpe.thermalcorrgfe: 0.289639 hartree
zpe.sumelectzpe: -814.266158 hartree
zpe.sumelectthermal: -814.247953 hartree
zpe.sumelectthermalent: -814.247009 hartree
zpe.sumelectthermalfe: -814.310843 hartree
dipole: 0.4242 1.8771 -0.6219
dipole: 2.0224
quadrupole: -108.8659 -107.2017 -118.7898
quadrupole: 0.6011 6.8369 -3.1367
quadrupole: 2.7533 4.4174 -7.1707 0.6011 6.8369 -3.1367
hfenergy: -814.6004821 hartree
pointgroup: C01[X(C17H20B1N1O1)]
dipole: 0.1669018 0.7384998 -0.244679 debye
polarizability: 289.2879868|28.9049978|267.4694878|37.5723732|-51.7967723|219.565614 unknown
InChI: InChI=1/C17H20BNO/c1-17(2)11-7-5-9-13(18)15(11)20-16-12(17)8-6-10-14(16)19(3)4/h5-10H,18H2,1-4H3
charge 0 multiplicity 1
40 atoms
C  -2.09841338 1.42204277 1.03379091
C  -0.73269891 1.28292926 1.33547204
C  0.18325422 2.27291863 1.02373754
C  -0.25689228 3.44846605 0.42164943
C  -1.60047149 3.65811664 0.12378014
C  -2.4907978 2.62623796 0.42157721
H  -0.39886629 0.36709023 1.81198576
H  1.23505744 2.14354476 1.2499456
H  0.46883398 4.22019844 0.19448676
C  -2.16648031 4.96759569 -0.41663286
O  -3.81340406 2.77176787 0.1310629
C  -1.10526109 5.79826166 -1.14140223
H  -1.52953268 6.74004215 -1.4941901
H  -0.29216825 6.06224341 -0.46216556
H  -0.68681217 5.26190334 -1.99679081
C  -2.7070848 5.78723844 0.77937765
H  -1.89280961 6.03019118 1.4680886
H  -3.15643557 6.71833412 0.42297821
H  -3.46758246 5.22930141 1.33060639
C  -3.34366059 4.61876078 -1.32341007
C  -4.14997173 3.55191744 -0.94936851
C  -3.68353034 5.33248641 -2.47326515
C  -5.3171823 3.19000588 -1.64780141
C  -4.81311169 4.98766948 -3.19678104
H  -3.06926753 6.15898899 -2.80577655
C  -5.62867515 3.94034472 -2.78379491
H  -5.07413333 5.54622932 -4.08853819
H  -6.51367671 3.70196655 -3.35912214
B  -3.07836186 0.27426697 1.33573961
N  -6.07417883 2.08193826 -1.22960076
C  -6.64371219 2.15952117 0.11110095
H  -7.49167977 2.86225889 0.14995723
H  -7.00262163 1.16958559 0.40219246
H  -5.89076772 2.46930532 0.83133105
C  -7.02171729 1.54741002 -2.18727352
H  -7.37800785 0.58302312 -1.81906435
H  -7.90125631 2.19542554 -2.33943883
H  -6.53578159 1.38424434 -3.1508558
H  -4.23052215 0.3279319 1.03450404
H  -2.65440595 -0.70209183 1.88507806
