program: Gaussian 16
title: me_biphenylene
version: ES64L-G16RevC.02
method: RwB97XD
basis: GenECP
operation: Freq
keyword: #N
keyword: Geom=AllCheck
keyword: Guess=TCheck
keyword: SCRF=Check
keyword: GenChk
keyword: RwB97XD/GenECP
keyword: Freq
converged: YES YES NO YES
title: Mulliken charges:
elementType: C C C C C C C H C H H C H C H C C H B N C H H H C H H H C H H H C H H H
charge: 0.280053 0.040199 0.233981 0.107711 -0.546664 -0.160417 -0.372077 0.195043 -0.186040 0.235957 0.193128 -0.392502 0.216127 -0.467171 0.230797 -0.144543 0.215531 0.205854 -0.017149 0.198029 -0.647329 0.242348 0.144192 0.201459 -0.649825 0.147086 0.191001 0.152938 -0.386476 0.161979 0.181405 0.169228 -0.458246 0.182593 0.206033 0.095766
chargesum: -0.00000
title: Mulliken charges with hydrogens summed into heavy atoms:
elementType: C C C C C C C C C C C C B N C C C C
charge: 0.280053 0.040199 0.233981 0.107711 -0.351621 -0.160417 -0.136121 0.007088 -0.176375 -0.236374 0.061311 0.215531 -0.017149 0.198029 -0.059329 -0.158799 0.126136 0.026146
chargesum: 0.00000
1716.lowfreq: -4.6157 -0.0003 0.0002 0.0004 2.0256 5.9070 47.3863 64.3189 89.1148
frequency: 47.3803 64.3163 89.1129 99.6470 104.1192 128.0923 137.8291 159.9851 176.1631 188.2399 235.9361 262.1417 268.0785 288.1808 299.2672 319.2226 350.7183 364.2867 372.1940 415.5142 464.1920 471.6307 491.1069 509.0432 561.4645 575.7914 609.3170 639.1354 648.1045 683.9187 733.3173 744.6125 757.5048 778.1243 790.4159 826.3343 842.6410 851.7567 902.7782 904.2164 919.0690 940.6610 992.0143 993.0785 1001.1320 1003.4222 1047.3870 1058.3722 1084.5864 1088.9420 1122.9629 1138.3825 1143.9388 1170.6438 1178.4534 1193.2958 1200.0517 1223.4894 1238.4365 1252.9682 1297.9205 1313.7054 1333.7166 1344.4974 1392.1995 1403.5886 1441.9033 1447.1417 1447.9447 1452.0703 1470.1629 1476.0751 1477.6270 1492.1200 1496.9236 1501.1233 1507.0999 1516.0596 1522.2246 1537.3561 1640.9617 1659.9190 1673.2577 1737.4103 2974.1432 2988.2927 3007.1134 3009.5235 3079.7118 3081.0926 3093.2231 3095.5998 3123.6274 3124.8458 3138.6876 3159.7366 3178.1854 3189.7547 3196.3846 3211.3285 3216.9032 3222.4609
redmass: 3.4834 2.9620 3.1414 1.2203 4.0002 2.9998 1.7163 2.1706 2.4338 1.7595 1.5557 1.9997 2.4499 2.4698 1.5743 2.7476 4.1952 4.1517 2.6563 2.4868 3.7792 3.6887 3.4333 3.7726 3.5635 3.9031 6.1192 4.6768 5.3068 1.3165 3.1691 4.5865 3.9045 1.5456 1.5347 4.4958 2.5261 1.3713 1.3950 3.1998 2.1243 1.4419 1.3281 3.2103 1.5532 3.7776 3.0723 2.7773 1.5235 1.5812 1.2700 2.2095 2.5967 1.5164 1.8832 1.9264 1.4149 2.4648 2.0462 2.3837 3.0280 2.6640 1.4788 1.4911 2.7768 2.3567 2.0765 1.1149 1.1197 1.1780 1.0882 1.1301 1.1780 1.0975 1.7948 1.1964 1.0658 1.4213 4.6329 1.6589 8.7604 9.1508 6.7787 8.3482 1.0553 1.0549 1.0453 1.0472 1.0859 1.0851 1.0782 1.0835 1.1027 1.1020 1.1041 1.0994 1.0866 1.0880 1.0923 1.0965 1.0925 1.0951
irintensity: 0.2046 1.0697 0.8811 0.6534 6.3197 0.0697 2.5523 0.4922 0.8237 3.0337 2.6048 0.3840 0.0060 2.7832 3.8007 2.3397 0.5043 1.9063 1.2412 2.4727 9.7368 1.7517 1.6384 1.5162 2.3538 3.3593 1.7557 4.9935 1.7760 2.5737 22.9167 8.4699 5.0116 3.0075 125.8444 1.0079 8.3769 2.7410 0.3249 5.2920 26.0265 6.7347 1.5124 56.1889 8.2395 12.5439 15.6982 10.4803 30.6562 13.9082 3.2876 36.7056 21.4073 80.8162 44.5298 40.7441 5.2026 11.7303 8.5594 73.8052 22.1229 22.3325 135.3641 110.0253 122.1834 52.8231 20.6534 0.6593 3.9232 4.4074 1.0939 12.8004 24.9609 5.4455 12.3465 41.9276 8.6648 2.8530 6.1105 150.1741 66.5309 75.9000 130.4232 36.1425 125.6622 118.6936 8.1260 3.9784 21.6940 27.0963 43.1423 28.1977 12.6129 34.0066 20.4449 16.3979 5.1115 9.6984 21.9872 26.0139 13.4091 17.5015
temp: 298.150 k
press: 1.00000 atm
elementType: 6 6 6 6 6 6 6 1 6 1 1 6 1 6 1 6 6 1 5 7 6 1 1 1 6 1 1 1 6 1 1 1 6 1 1 1
symmnumber: 1
zpe: 788463.1 jmol-1
zpe.correction: 0.300310 hartree
zpe.thermalcorrener: 0.317477 hartree
zpe.thermalcorrenthalpy: 0.318422 hartree
zpe.thermalcorrgfe: 0.256370 hartree
zpe.sumelectzpe: -699.735529 hartree
zpe.sumelectthermal: -699.718361 hartree
zpe.sumelectthermalent: -699.717417 hartree
zpe.sumelectthermalfe: -699.779469 hartree
dipole: -0.8396 1.0546 1.3047
dipole: 1.8760
quadrupole: -114.8071 -91.9223 -95.8896
quadrupole: -5.0527 -0.9139 7.7616
quadrupole: -13.9341 8.9507 4.9834 -5.0527 -0.9139 7.7616
hfenergy: -700.0358388 hartree
pointgroup: C01 [X(C16H18B1N1)]
dipole: -0.3303429 0.4148929 0.5133058 debye
polarizability: 154.1319147|-37.3518269|321.4179377|-5.5366223|3.316605|282.0861677 unknown
InChI: InChI=1/C16H18BN/c1-17(2)13-9-5-7-11-12-8-6-10-14(18(3)4)16(12)15(11)13/h5-10H,1-4H3
charge 0 multiplicity 1
36 atoms
C  1.89463703 2.47779609 -0.17775235
C  1.85441762 2.55224957 -1.59295911
C  1.55513752 4.02490732 -1.50888337
C  1.54124532 3.94649544 -0.09934506
C  1.37061213 5.18882553 -2.20250236
C  1.25818827 5.03972429 0.6997161
C  1.13779754 6.32459136 -1.39829992
H  1.39823963 5.25609221 -3.28273621
C  1.0743101 6.25646326 -0.01773469
H  0.98138085 7.28716267 -1.87338357
H  0.85851036 7.16641247 0.52761213
C  2.08181721 1.47222027 -2.39322433
H  2.06361653 1.51706422 -3.47582389
C  2.34918592 0.25616526 -1.71479149
H  2.52878209 -0.64325828 -2.29360761
C  2.39343946 0.19058434 -0.33712272
C  2.19610485 1.32452331 0.5146568
H  2.61586429 -0.76780672 0.12180256
B  2.43576633 1.21067582 2.06133257
N  1.16793948 4.95768657 2.08986257
C  3.22940905 2.34411222 2.80335063
H  3.06652532 3.34775199 2.40073557
H  3.07658282 2.35482424 3.88678278
H  4.29382595 2.11532027 2.63754436
C  1.94694297 -0.05313695 2.85848392
H  2.62961066 -0.33950804 3.66472033
H  1.01202945 0.2512611 3.35452399
H  1.70693301 -0.9306703 2.25329147
C  1.05101037 6.18917005 2.84330636
H  0.07270139 6.68025415 2.7172739
H  1.17961949 5.96022128 3.90302004
H  1.83675273 6.8889914 2.5542534
C  0.33091921 3.89101631 2.61598139
H  0.62518743 3.66381526 3.64326856
H  -0.73326385 4.17158824 2.60632236
H  0.44141472 2.98501469 2.02146053
