program: Gaussian 16
title: me_dibenzofuran
version: ES64L-G16RevC.02
method: RwB97XD
basis: GenECP
operation: Freq
keyword: #N
keyword: Geom=AllCheck
keyword: Guess=TCheck
keyword: SCRF=Check
keyword: GenChk
keyword: RwB97XD/GenECP
keyword: Freq
converged: YES YES YES YES
title: Mulliken charges:
elementType: C C O C C C C C H C H H C H C H C C H B N C H H H C H H H C H H H C H H H
charge: -0.434673 0.908955 0.017582 0.932935 -0.588666 -0.610482 -0.408583 -0.414474 0.168535 0.148138 0.236121 0.188111 -0.394982 0.202166 -0.601947 0.236842 0.002350 0.027573 0.194303 0.297673 0.102349 -0.659130 0.178990 0.162294 0.149035 -0.701222 0.193538 0.173165 0.137540 -0.460293 0.174032 0.163151 0.137274 -0.364639 0.184413 0.160379 0.161643
chargesum: -0.00000
title: Mulliken charges with hydrogens summed into heavy atoms:
elementType: C C O C C C C C C C C C C B N C C C C
charge: -0.434673 0.908955 0.017582 0.932935 -0.588666 -0.441947 -0.408583 -0.178353 0.336249 -0.192815 -0.365106 0.196653 0.027573 0.297673 0.102349 -0.168810 -0.196978 0.014165 0.141797
chargesum: 0.00000
1716.lowfreq: -8.7823 -4.7952 0.0001 0.0005 0.0005 5.0046 38.4706 50.8728 68.0875
frequency: 38.4591 50.8699 68.0808 69.6120 92.6356 107.9179 137.6527 173.6858 183.5420 205.1590 239.4521 273.9012 277.4042 290.2216 303.0465 307.6950 324.3250 344.4511 375.3159 389.1543 389.9676 459.7341 497.8932 529.8778 571.4592 572.2458 586.0444 595.9755 616.9070 637.5185 682.0709 706.2578 740.9171 756.3103 779.3073 798.4607 820.3857 826.8144 858.6066 867.2933 884.7895 899.2912 917.8383 930.3454 956.2662 989.4337 1006.4839 1008.1037 1082.8152 1084.4385 1093.2705 1099.5151 1125.8225 1144.3673 1172.0491 1176.3938 1191.9826 1208.5832 1220.5711 1244.2203 1260.6173 1278.3577 1295.5346 1330.6475 1337.8378 1340.5365 1358.7822 1384.1202 1391.2845 1442.3490 1449.1647 1450.5440 1459.8522 1470.3969 1476.3409 1479.4641 1480.4896 1490.6365 1501.6661 1504.7509 1521.0580 1533.3892 1552.9327 1644.4659 1666.1024 1671.9222 1689.7522 2968.9601 2980.5764 3016.4627 3025.6637 3082.7866 3092.0069 3092.2494 3100.5388 3121.2569 3127.0024 3138.3256 3182.0105 3189.0004 3193.7564 3199.5108 3213.2528 3213.6481 3226.3052
redmass: 2.7957 3.3572 2.9675 1.1558 4.6992 3.0403 3.5348 1.9588 3.6213 1.4569 1.1007 2.9960 2.4219 2.1697 2.1526 3.4644 3.2283 3.7622 3.3292 2.3692 3.1058 3.1796 3.8106 3.4381 3.8268 4.3246 4.1832 5.9442 5.2448 4.5577 1.4419 4.4978 4.3231 1.6968 2.4715 1.9358 2.7588 2.5329 1.3901 4.3579 5.0843 1.4290 3.1691 2.2592 1.4762 1.3011 1.3330 3.1110 1.5010 2.1827 2.5229 2.0078 1.2637 2.4428 1.6821 1.4715 1.2572 1.8587 2.8975 2.5415 2.6119 2.8409 2.7502 1.4331 2.0205 1.5343 6.4848 4.6083 3.2833 2.1737 1.3329 1.1049 1.0620 1.7863 1.1079 1.3553 1.1521 1.0426 1.1230 1.0480 1.1649 2.9577 2.9288 7.0771 7.5686 7.1491 8.5955 1.0561 1.0569 1.0448 1.0406 1.0891 1.0771 1.0913 1.0835 1.1028 1.1002 1.1043 1.0976 1.0866 1.0874 1.0914 1.0964 1.0959 1.0933
irintensity: 0.5696 0.0281 1.6725 0.4703 3.7151 1.5215 0.3330 1.5815 0.6569 0.5478 1.0446 1.4860 5.7608 0.3416 0.4268 0.8588 1.9155 1.0515 1.7954 1.6237 1.1643 9.4113 0.5577 0.6870 3.9497 4.9553 2.7260 15.4687 1.4738 5.3010 8.9609 1.2363 2.0876 36.0312 37.8224 79.9659 3.7172 13.1797 3.4550 3.4608 41.1099 0.7449 11.1420 20.2920 5.1533 0.6698 0.3481 59.7787 22.4613 11.8641 49.9444 57.2188 3.4368 31.3359 71.7877 13.7816 6.3497 47.8689 289.6895 44.5898 21.1121 99.7470 122.8304 87.3761 37.5991 116.0773 6.0327 2.9681 96.5893 102.6489 30.4877 3.6298 2.5211 30.6452 7.3471 24.2808 12.1346 17.1859 15.5820 20.9619 15.0559 47.0718 140.8968 28.5770 60.8529 89.9975 46.1307 98.9326 141.5748 3.9006 3.1323 17.6714 35.6279 19.5719 39.5083 44.4690 36.0013 23.9646 2.1500 0.5974 8.3004 10.6466 10.2393 32.5867 8.8689
temp: 298.150 k
press: 1.00000 atm
elementType: 6 6 8 6 6 6 6 6 1 6 1 1 6 1 6 1 6 6 1 5 7 6 1 1 1 6 1 1 1 6 1 1 1 6 1 1 1
symmnumber: 1
zpe: 805143.7 jmol-1
zpe.correction: 0.306663 hartree
zpe.thermalcorrener: 0.324344 hartree
zpe.thermalcorrenthalpy: 0.325289 hartree
zpe.thermalcorrgfe: 0.261308 hartree
zpe.sumelectzpe: -775.024526 hartree
zpe.sumelectthermal: -775.006845 hartree
zpe.sumelectthermalent: -775.005901 hartree
zpe.sumelectthermalfe: -775.069881 hartree
dipole: 0.0585 1.0437 0.1455
dipole: 1.0554
quadrupole: -113.9729 -97.1094 -102.6258
quadrupole: -5.9833 -0.7123 5.8654
quadrupole: -9.4035 7.4599 1.9436 -5.9833 -0.7123 5.8654
hfenergy: -775.3311895 hartree
pointgroup: C01 [X(C16H18B1N1O1)]
dipole: 0.0230026 0.4106236 0.0572457 debye
polarizability: 177.454516|-73.8708971|291.8243974|5.2845556|5.5413981|285.0305435 unknown
InChI: InChI=1/C16H18BNO/c1-17(2)13-9-5-7-11-12-8-6-10-14(18(3)4)16(12)19-15(11)13/h5-10H,1-4H3
charge 0 multiplicity 1
37 atoms
C  2.10997207 2.16274673 0.18719329
C  1.91978717 2.54009303 -1.14636918
O  1.62483248 3.11964631 1.03249962
C  1.26811116 3.83505895 -1.10533596
C  1.12466658 4.12600427 0.24845207
C  0.77933612 4.71621065 -2.07122653
C  0.5091818 5.28807221 0.73615199
C  0.15926737 5.86775797 -1.62254877
H  0.87417256 4.50083043 -3.12860941
C  0.0322571 6.15093441 -0.25631085
H  -0.23640187 6.58024593 -2.33755973
H  -0.45236054 7.07430905 0.03244546
C  2.34168138 1.68935139 -2.16334607
H  2.21033414 1.96114327 -3.2047784
C  2.93088865 0.48320039 -1.80998676
H  3.2682777 -0.1980435 -2.58254596
C  3.08755379 0.13282844 -0.46712594
C  2.69316417 0.96006574 0.59669246
H  3.54881659 -0.82165771 -0.2380664
B  2.95088356 0.55290489 2.09174375
N  0.34809219 5.51109412 2.1084202
C  2.91852635 1.63030543 3.23862729
H  1.87308994 1.91906091 3.41412511
H  3.32647902 1.26486119 4.18478173
H  3.43008703 2.55651173 2.95947203
C  3.28361441 -0.93879709 2.46982293
H  4.36528556 -0.99968525 2.66074023
H  2.80804449 -1.21306305 3.41760364
H  3.03703103 -1.69589864 1.72251133
C  1.55326166 5.42999957 2.92690187
H  2.20412342 6.30570724 2.77805588
H  1.26494931 5.38867504 3.97935571
H  2.11543534 4.52877711 2.69585836
C  -0.50613751 6.61698025 2.49288614
H  -0.67956577 6.56188829 3.56913631
H  -0.06469957 7.60211351 2.26953061
H  -1.4722764 6.54313303 1.99047946
