program: Gaussian 16
title: me_indenoPy_nbo
version: ES64L-G16RevC.02
method: RwB97XD
basis: GenECP
operation: Freq
keyword: #N
keyword: Geom=AllCheck
keyword: Guess=TCheck
keyword: SCRF=Check
keyword: GenChk
keyword: RwB97XD/GenECP
keyword: Freq
converged: YES YES YES YES
title: Mulliken charges:
elementType: C C C C C C H H H C H H C C C C C H H H N B C H H H C H H H
charge: 0.061965 0.130117 0.228429 -0.244637 -0.238429 -0.238450 0.246531 0.221016 0.215533 -0.456675 0.223508 0.223626 -0.956917 -0.055512 0.278212 0.363612 -0.499483 0.246526 0.240284 0.239435 0.122845 -0.124269 -0.650375 0.155606 0.185562 0.196471 -0.652166 0.185570 0.155504 0.196560
chargesum: 0.00000
title: Mulliken charges with hydrogens summed into heavy atoms:
elementType: C C C C C C C C C C C C N B C C
charge: 0.061965 0.130117 0.228429 0.001894 -0.017413 -0.022917 -0.009541 -0.956917 -0.055512 0.524739 0.603896 -0.260048 0.122845 -0.124269 -0.112736 -0.114532
chargesum: -0.00000
1716.lowfreq: -5.1304 -0.0003 -0.0002 0.0004 5.5007 17.8807 39.5477 69.5744 85.0830
frequency: 39.3133 69.5556 85.0441 88.1606 101.5063 116.2779 151.6392 217.9799 241.5757 252.1080 257.5728 330.3899 409.9870 414.8523 436.0812 474.6816 501.9848 552.4633 557.6272 566.4452 585.8557 648.0910 666.9640 680.3045 749.8073 768.9758 791.1868 801.1107 805.0442 828.7782 863.2976 870.9581 921.2912 923.2273 934.9491 954.7621 988.2322 1008.0527 1013.8547 1048.3761 1076.5359 1093.5865 1115.5222 1138.9556 1142.0178 1173.5424 1197.3275 1204.8706 1210.2686 1264.8286 1280.7366 1290.8193 1325.8464 1330.0346 1331.6969 1337.2724 1384.2383 1439.8430 1447.6152 1448.9510 1451.7808 1464.8345 1472.6671 1480.6385 1520.2380 1530.0775 1646.5846 1659.2886 1669.2452 1676.1572 3008.9933 3011.1371 3058.9711 3086.9697 3088.3559 3097.9343 3127.9351 3129.8773 3169.2952 3180.9712 3185.7313 3191.9233 3202.1074 3218.1934
redmass: 2.9334 1.5198 1.9611 2.5673 2.9082 1.2233 4.1287 4.0154 2.2055 2.6089 3.7428 4.0173 3.5921 2.9006 3.7822 2.9153 3.5278 4.1865 3.4994 5.3328 3.2862 6.5885 1.2313 6.3976 3.8818 3.5026 1.2246 3.2435 1.4095 3.5852 5.1113 1.4109 2.2383 1.5029 2.6176 1.6288 1.5351 1.3404 1.4064 5.8969 2.3209 2.5309 2.0939 1.5475 2.8012 1.1414 1.3613 1.4267 2.4300 2.0173 4.0862 2.6312 2.0866 1.5101 1.4976 3.7139 2.8834 1.0588 1.4251 1.1562 1.5541 1.0793 1.9596 1.2463 2.7504 3.4438 7.0571 6.7130 7.3826 8.1204 1.0467 1.0464 1.0608 1.0843 1.0845 1.1024 1.1036 1.1030 1.0877 1.0896 1.0903 1.0918 1.0971 1.0969
irintensity: 0.2190 0.9418 0.3993 1.3018 3.0626 1.2076 0.8520 2.6157 6.0518 0.6518 3.6244 1.6549 3.6858 3.7745 0.2805 0.9742 2.5054 0.0988 0.3211 0.2510 0.3316 6.7739 1.1039 10.2000 11.6407 4.2198 96.8998 7.3899 5.8282 11.4979 3.4526 0.3020 30.7169 3.3267 22.9938 0.6887 0.6459 0.9032 1.8024 2.5648 4.0333 36.7372 18.5885 16.9753 60.0615 0.0215 24.7519 1.2575 12.5826 3.6189 29.1551 33.5901 0.2150 76.8548 145.0093 12.9203 5.1666 0.1328 31.9344 17.2095 49.2460 2.0484 14.8812 16.9193 0.5111 20.6579 21.0468 3.1564 61.8241 38.1010 2.7767 12.2146 16.2644 10.6124 28.8219 5.3037 5.4726 64.1032 12.1677 21.6650 15.5455 14.5153 36.1656 20.4753
temp: 298.150 k
press: 1.00000 atm
elementType: 6 6 6 6 6 6 1 1 1 6 1 1 6 6 6 6 6 1 1 1 7 5 6 1 1 1 6 1 1 1
symmnumber: 1
zpe: 641693.5 jmol-1
zpe.correction: 0.244408 hartree
zpe.thermalcorrener: 0.258576 hartree
zpe.thermalcorrenthalpy: 0.259520 hartree
zpe.thermalcorrgfe: 0.202955 hartree
zpe.sumelectzpe: -621.254679 hartree
zpe.sumelectthermal: -621.240510 hartree
zpe.sumelectthermalent: -621.239566 hartree
zpe.sumelectthermalfe: -621.296131 hartree
dipole: -1.4683 -1.6332 -1.7923
dipole: 2.8347
quadrupole: -97.7550 -83.3519 -95.0441
quadrupole: -6.8552 0.0567 5.2183
quadrupole: -5.7046 8.6984 -2.9937 -6.8552 0.0567 5.2183
hfenergy: -621.4990867 hartree
pointgroup: C01 [X(C14H14B1N1)]
dipole: -0.5776615 -0.6425649 -0.7051324 debye
polarizability: 208.8446098|-36.9806727|248.4395406|39.5033067|32.9022671|169.4185979 unknown
InChI: InChI=1/C14H14BN/c1-15(2)12-7-3-5-10-9-11-6-4-8-16-14(11)13(10)12/h3-8H,9H2,1-2H3
charge 0 multiplicity 1
30 atoms
C  0.67355221 0.72149461 -0.4567682
C  1.81842974 0.73698828 0.34341959
C  2.20087088 1.82334921 1.12964381
C  1.35358099 2.93508493 1.07608959
C  0.20460796 2.93954966 0.28197828
C  -0.14975711 1.83592721 -0.49291042
H  1.58377414 3.82093981 1.66102752
H  -0.42537557 3.8227357 0.26921317
H  -1.04615784 1.85701481 -1.10356083
C  0.55621778 -0.60833459 -1.17429833
H  0.56336067 -0.48506602 -2.2619138
H  -0.37031404 -1.12982554 -0.91401141
C  2.49732631 -0.54627214 0.19973269
C  1.77479759 -1.35537947 -0.68740716
C  4.07939283 -2.11642015 0.54621947
C  2.26089515 -2.61972726 -0.95431059
C  3.44378957 -3.00235923 -0.31732946
H  4.99906584 -2.40631087 1.04526866
H  1.75136807 -3.2977835 -1.63097504
H  3.87250308 -3.9823526 -0.4879415
N  3.62237313 -0.88845862 0.81587412
B  3.51704552 1.73934369 2.00291022
C  3.38958019 1.3018275 3.50643025
H  4.33689184 1.0094191 3.96592817
H  3.01167293 2.17539151 4.06017901
H  2.65118039 0.50882233 3.65340224
C  4.853904 2.29970165 1.39708947
H  4.80419852 3.39683336 1.47641577
H  5.75237543 1.97463582 1.92732296
H  4.95796927 2.07852692 0.33126281
