program: Gaussian 16
title: MeQHBMe2
version: ES64L-G16RevC.01
method: RwB97XD
basis: GenECP
operation: Freq
keyword: #N
keyword: Geom=AllCheck
keyword: Guess=TCheck
keyword: SCRF=Check
keyword: GenChk
keyword: RwB97XD/GenECP
keyword: Freq
converged: YES YES YES YES
title: Mulliken charges:
elementType: C H C N N N B C H H H C H H H C H H H
charge: -0.321177 0.257547 -0.397488 0.239374 -0.054721 -0.107919 0.443628 -0.369537 0.205091 0.215161 0.178316 -0.594488 0.132321 0.161133 0.194236 -0.660718 0.179983 0.158411 0.140849
chargesum: -0.00000
title: Mulliken charges with hydrogens summed into heavy atoms:
elementType: C C N N N B C C C
charge: -0.063629 -0.397488 0.239374 -0.054721 -0.107919 0.443628 0.229030 -0.106799 -0.181475
1716.lowfreq: -18.1997 -9.8147 -0.0003 0.0004 0.0004 8.5700 49.0365 60.7744 78.1972
frequency: 46.8034 60.5600 78.1719 119.7067 129.9758 142.2540 249.9070 273.2067 334.6299 407.3855 454.6550 500.9942 655.9149 697.8403 723.0997 738.4330 838.8292 843.3587 861.8153 926.1661 1006.9759 1051.0892 1090.8418 1104.9062 1145.0975 1152.8609 1210.0389 1286.1034 1308.4914 1330.4295 1347.6837 1406.3494 1447.7408 1450.6483 1457.1308 1468.7171 1476.5155 1487.2044 1492.1166 1537.4055 1570.5207 3014.3304 3018.0156 3075.0798 3083.4780 3086.5110 3118.5931 3135.5721 3159.7931 3184.9679 3287.5670
redmass: 1.0403 3.1630 1.1671 1.2638 1.8626 3.1487 4.0304 2.4640 3.0394 2.1241 3.5259 3.2643 3.4448 1.4557 3.5692 5.6883 1.8395 1.4280 1.4208 2.2835 3.4841 2.8542 2.8249 1.9402 2.3121 1.4636 2.5569 3.1030 4.9576 1.3725 1.6920 5.0418 1.0474 1.1194 1.2677 1.1056 1.0946 1.0482 1.4050 2.4463 4.9578 1.0465 1.0438 1.0340 1.0887 1.0866 1.1017 1.1016 1.1049 1.1058 1.1009
irintensity: 0.1785 7.9859 1.3935 0.2705 0.3573 3.9809 0.8769 0.0418 3.9600 1.0682 3.5413 4.4923 3.1547 2.9425 13.0597 1.8046 13.5471 5.0687 32.2185 28.0415 26.0649 36.5651 25.8241 7.1473 39.5429 17.0083 158.7598 5.4779 42.9045 86.6004 161.4283 29.7868 3.4255 1.9536 3.1874 3.1488 11.5176 19.3411 21.4392 1.6812 150.8681 3.7531 3.5287 34.2551 13.6225 34.1499 37.8605 18.8347 8.5639 2.7269 0.6555
temp: 298.150 k
press: 1.00000 atm
elementType: 6 1 6 7 7 7 5 6 1 1 1 6 1 1 1 6 1 1 1
symmnumber: 1
zpe: 407187.8 jmol-1
zpe.correction: 0.155090 hartree
zpe.thermalcorrener: 0.165455 hartree
zpe.thermalcorrenthalpy: 0.166400 hartree
zpe.thermalcorrgfe: 0.118414 hartree
zpe.sumelectzpe: -385.468486 hartree
zpe.sumelectthermal: -385.458120 hartree
zpe.sumelectthermalent: -385.457176 hartree
zpe.sumelectthermalfe: -385.505162 hartree
dipole: -1.6246 3.8185 3.6013
dipole: 5.4945
quadrupole: -61.0405 -40.2241 -56.6230
quadrupole: 4.7039 9.5991 3.4343
quadrupole: -8.4113 12.4051 -3.9938 4.7039 9.5991 3.4343
hfenergy: -385.6235758 hartree
pointgroup: C01 [X(C5H10B1N3)]
dipole: -0.6391644 1.5023296 1.4168516 debye
dipolederiv: 0.1375477 -0.2522252 0.04818 -0.2513096 0.3600788 -0.0547131 0.154167 -0.2264199 0.0255709 0.1723926 0.0262553 0.0100503 0.023545 0.1200191 -0.0559003 0.004003 -0.0473066 0.059325 -0.3838014 0.3658818 -0.1719371 0.3434894 -0.6253871 0.1623835 -0.2374862 0.27537 -0.478484 -0.2429334 0.2704492 -0.002383 0.3315418 -0.5934229 0.010489 -0.1263666 0.170519 -0.1336524 -0.2226235 -0.0276484 -0.3150946 -0.00074 -0.022999 0.4544307 -0.2043447 0.293426 -0.3029091 -0.2431933 0.0565613 0.2025585 0.0506307 -0.3852518 -0.2055574 0.1413636 -0.1268424 0.127213 0.7676718 -0.5290597 0.312782 -0.500171 1.3156511 -0.122073 0.3841586 -0.1742672 1.1820915 0.3810784 -0.1611489 0.0279509 -0.2443641 0.5488596 -0.0566939 0.0295772 -0.0482629 0.1538946 0.0730948 0.0189282 0.048758 0.0472906 0.0485825 0.0100728 -0.003041 0.0908851 -0.0163393 -0.110755 0.070784 0.0103768 -0.0195714 -0.0310004 0.0329317 0.0359766 0.01007 0.0969066 0.0410229 -0.0274045 -0.0773175 0.0434416 -0.0233959 -0.0316912 -0.0410314 -0.0993984 0.0207646 -0.2198035 0.0096412 -0.2684318 -0.0289676 -0.1434524 -0.0699368 -0.2002054 -0.0070071 -0.620213 0.010589 0.1024329 0.1024579 0.1029372 -0.0610219 -0.0963975 0.0643444 -0.0904884 0.0198574 0.1035748 -0.0003404 0.0452633 0.0104134 -0.0850244 0.1189508 -0.0119195 0.1175471 0.0054081 -0.087909 -0.0503937 0.010888 -0.0577283 0.0742138 -0.0150617 -0.0164946 0.0057891 0.0786947 -0.1198273 0.0416462 0.0325213 0.1821822 -0.6722715 -0.1685572 0.043613 -0.1794475 -0.2271451 -0.0276813 -0.0696307 0.0296647 -0.09406 0.0034359 0.0299137 0.0300282 0.0108178 0.0889329 0.0758773 0.021531 0.0379905 -0.0197987 0.1182374 0.0039573 0.0353113 -0.0082583 -0.1164362 -0.1043217 0.1337403 -0.0842779 0.0812387 0.054149 0.0534525 -0.0816533 0.0332743 0.0365199 unknown
polarizability: 91.5383467|-26.9123589|115.3389211|12.1187562|-5.1072957|108.3871729 unknown
InChI: InChI=1/C5H10BN3/c1-6(2)5-4-9(3)8-7-5/h4H,1-3H3
charge 0 multiplicity 1
19 atoms
C  2.58127573 1.63770497 1.1633201
H  2.50055542 2.10865188 2.12933304
C  3.19841034 0.47048061 0.74831774
N  2.0337236 2.16953979 0.06212709
N  2.27976144 1.38739281 -1.00742631
N  2.97163248 0.3790137 -0.60603808
B  4.00298268 -0.57420677 1.56652001
C  1.22543409 3.36580024 -0.0775742
H  1.35412677 3.74656209 -1.08879082
H  0.17337692 3.13503802 0.09500799
H  1.56218792 4.11235365 0.64022016
C  4.28821545 -0.3277485 3.09506713
H  3.6607017 0.42424455 3.58066695
H  4.2387573 -1.25593115 3.67370002
H  5.32928939 0.01671181 3.17852092
C  4.52426108 -1.87820859 0.86740399
H  3.74503198 -2.64312666 1.00556632
H  4.66910066 -1.77568389 -0.20996941
H  5.43066475 -2.27996253 1.33026281
