program: Gaussian 16
title: me_naphthalene
version: ES64L-G16RevC.02
method: RwB97XD
basis: GenECP
operation: Freq
keyword: #N
keyword: Geom=AllCheck
keyword: Guess=TCheck
keyword: SCRF=Check
keyword: GenChk
keyword: RwB97XD/GenECP
keyword: Freq
converged: YES YES YES YES
title: Mulliken charges:
elementType: C C C C C C H C C H H C C H H H B C H H H C H H H N C H H H C H H H
charge: -0.292048 0.145907 -0.130645 0.255504 -0.263480 -0.406396 0.193728 0.012399 -0.093525 0.198649 0.236240 -0.434381 -0.197147 0.213550 0.219462 0.229821 -0.367726 -0.555090 0.143235 0.188572 0.173566 -0.542935 0.169938 0.165241 0.159794 -0.095281 -0.256107 0.169891 0.238945 0.230299 -0.372764 0.220905 0.207487 0.234394
chargesum: -0.00000
title: Mulliken charges with hydrogens summed into heavy atoms:
elementType: C C C C C C C C C C B C C N C C
charge: -0.098321 0.145907 -0.130645 0.255504 -0.064831 -0.170156 0.012399 0.120024 -0.214919 0.032674 -0.367726 -0.049717 -0.047962 -0.095281 0.383027 0.290022
chargesum: 0.00000
1716.lowfreq: -5.4736 0.0005 0.0006 0.0006 5.7353 10.5755 56.5227 110.6945 162.4351
frequency: 56.5078 110.6932 162.4347 170.1524 209.5019 244.1620 256.5124 259.1724 278.6516 290.2981 296.1624 327.6859 335.3473 354.4476 357.9985 379.5940 416.6085 470.1532 478.5649 495.5722 523.9347 545.9514 566.0843 570.7768 636.5431 661.3715 686.6846 751.0019 775.6409 796.2426 805.3585 810.7609 817.8779 840.7289 862.5950 911.5100 921.5849 935.7603 955.4950 987.3526 1003.2992 1011.0834 1037.7423 1054.4524 1066.6713 1081.0653 1084.6145 1135.4615 1141.3484 1177.3904 1202.2936 1214.4209 1228.4733 1245.5224 1256.7101 1271.1280 1307.9926 1326.7401 1335.4844 1378.0490 1405.1407 1448.4044 1456.2210 1469.6929 1473.4912 1473.8564 1480.1062 1480.9673 1485.3995 1498.1678 1501.6620 1514.0400 1517.7839 1523.5138 1552.4899 1657.8716 1664.3514 1700.9745 3007.6499 3010.7210 3062.1980 3065.6074 3073.0968 3078.6150 3083.7439 3091.8928 3146.2592 3153.3665 3168.0894 3180.9635 3181.8955 3184.3502 3190.3416 3198.5328 3199.5402 3212.5028
redmass: 3.3444 3.3503 3.7595 2.8197 2.3206 1.3401 2.3176 2.7723 1.4959 1.5592 1.3512 2.1585 2.0215 1.2062 2.8054 3.5378 3.1634 3.2495 3.3023 3.7191 4.6571 3.8354 3.5672 4.5238 3.6532 3.9439 3.1349 4.0819 1.3099 1.3470 1.5610 2.3892 4.8149 1.5653 2.7453 2.7833 1.4114 1.4417 2.1623 2.9382 1.3227 1.3338 2.9120 2.0369 2.5804 2.1224 2.2297 1.6408 1.6766 1.4112 1.2852 2.3179 1.7559 1.8845 1.7389 2.0820 2.3702 1.3094 1.3076 3.3233 3.2852 1.1530 2.1728 1.0840 1.0847 3.7360 1.1001 1.1217 1.0553 1.0557 1.1500 2.2081 1.0498 1.0801 4.1674 5.8712 7.6775 7.3700 1.0376 1.0390 1.0353 1.0374 1.0964 1.1006 1.0980 1.0991 1.1023 1.1016 1.0873 1.1064 1.0899 1.0875 1.1041 1.0968 1.0924 1.0966
irintensity: 0.8519 1.6445 1.8220 1.8136 0.6227 0.6579 1.0730 0.2800 0.4696 0.1783 0.1175 0.2062 1.0654 0.9240 2.9977 8.0171 13.7577 6.2796 1.0184 13.1247 2.4870 1.5465 0.3266 1.8026 1.4231 41.7764 3.2900 0.2483 2.0355 0.6092 104.7539 15.1577 2.1853 14.4131 11.8101 25.9169 2.0628 0.8130 48.1752 16.3986 0.0585 1.5411 13.8516 17.1478 21.6386 6.0204 21.3486 39.2071 47.4274 18.9007 19.6262 13.2863 4.6012 3.1881 2.8492 7.0033 4.6286 53.9162 58.6557 6.8294 16.6950 4.0476 2.1710 0.7651 1.4456 15.1529 5.6136 0.8107 9.5520 2.3189 8.1543 6.0756 27.1923 27.7499 8.0829 11.7535 17.7026 14.0772 35.8702 50.3734 14.1914 46.1299 17.4107 73.1301 60.2964 58.7457 13.4471 16.7748 11.7210 10.2366 22.5529 2.2693 7.7004 32.6243 31.3745 15.6251
temp: 298.150 k
press: 1.00000 atm
elementType: 6 6 6 6 6 6 1 6 6 1 1 6 6 1 1 1 5 6 1 1 1 6 1 1 1 7 6 1 1 1 6 1 1 1
symmnumber: 1
zpe: 768402.8 jmol-1
zpe.correction: 0.292669 hartree
zpe.thermalcorrener: 0.306854 hartree
zpe.thermalcorrenthalpy: 0.307799 hartree
zpe.thermalcorrgfe: 0.253741 hartree
zpe.sumelectzpe: -623.632201 hartree
zpe.sumelectthermal: -623.618016 hartree
zpe.sumelectthermalent: -623.617072 hartree
zpe.sumelectthermalfe: -623.671130 hartree
dipole: -3.6053 -2.4229 -0.5883
dipole: 4.3834
quadrupole: -74.1261 -83.5357 -102.1110
quadrupole: 13.9558 -0.1750 0.4315
quadrupole: 12.4648 3.0552 -15.5200 13.9558 -0.1750 0.4315
hfenergy: -623.9248705 hartree
pointgroup: C01 [X(C14H18B1N1)]
dipole: -1.4184255 -0.9532504 -0.2314357 debye
polarizability: 250.6085292|4.4142445|244.0309807|-17.4635035|-6.789925|145.464452 unknown
InChI: InChI=1/C14H18BN/c1-15(2)12-9-5-7-11-8-6-10-13(14(11)12)16(15,3)4/h5-10H,1-4H3
charge 0 multiplicity 1
34 atoms
C  -5.38422733 -0.79919563 0.41168297
C  -4.04510305 -0.78494192 0.1454456
C  -3.34056498 0.41954251 -0.01769859
C  -4.00537192 1.6586483 0.03489053
C  -5.39890076 1.6387969 0.30735743
C  -6.05482094 0.44835117 0.50338227
H  -5.94011983 -1.72099017 0.53843729
C  -1.94877664 0.2606705 -0.21465499
C  -3.21170611 2.81375969 -0.18226349
H  -5.94508388 2.57478535 0.36540979
H  -7.11725679 0.45173999 0.71948573
C  -1.8642794 2.67725213 -0.41758961
C  -1.22454318 1.40983978 -0.42447013
H  -3.67201813 3.79608262 -0.1595519
H  -1.26573543 3.56701496 -0.58622268
H  -0.1497433 1.36794713 -0.57642107
B  -1.54447431 -1.27906373 0.04188424
C  -1.07450571 -1.47030828 1.58168003
H  -0.86901808 -2.51285294 1.85445366
H  -0.13564972 -0.91960546 1.71420562
H  -1.77860876 -1.05903557 2.31570087
C  -0.55186353 -1.99506469 -1.0066238
H  0.45479745 -1.59167112 -0.84240524
H  -0.47253107 -3.07918915 -0.84923607
H  -0.78665338 -1.82437045 -2.06243616
N  -3.17918047 -1.9400946 -0.10617618
C  -3.43429561 -3.06648465 0.81467725
H  -4.41711862 -3.50441863 0.62360759
H  -2.66789226 -3.8247102 0.6523471
H  -3.38264532 -2.71588241 1.84237492
C  -3.42607738 -2.39708224 -1.49975399
H  -2.77291149 -3.24037157 -1.7189873
H  -4.47094272 -2.69692997 -1.60956291
H  -3.2067355 -1.58096438 -2.18629985
