program: Gaussian 16
title: me_xanthene
version: ES64L-G16RevC.02
method: RwB97XD
basis: GenECP
operation: Freq
keyword: #N
keyword: Geom=AllCheck
keyword: Guess=TCheck
keyword: SCRF=Check
keyword: GenChk
keyword: RwB97XD/GenECP
keyword: Freq
converged: YES YES YES YES
title: Mulliken charges:
elementType: C C C C C C H H H C O C H H H C H H H C C C C C H C H H B N C H H H C H H H C H H H C H H H
charge: 0.433076 -0.198171 -0.795221 -0.344385 0.349456 0.033391 0.206214 0.239494 0.171565 -0.234912 -0.073822 -0.434732 0.168039 0.166323 0.200349 -0.779413 0.180746 0.186516 0.189586 0.360524 0.053447 0.008265 0.012270 -0.585251 0.160351 -0.448410 0.244417 0.177530 0.207575 0.253946 -0.713928 0.187612 0.143128 0.147767 -0.739130 0.185633 0.131831 0.324943 -0.413518 0.179382 0.168612 0.183206 -0.397161 0.174391 0.151383 0.177083
chargesum: -0.00000
title: Mulliken charges with hydrogens summed into heavy atoms:
elementType: C C C C C C C O C C C C C C C C B N C C C C
charge: 0.433076 0.008044 -0.555727 -0.172820 0.349456 0.033391 -0.234912 -0.073822 0.099979 -0.222565 0.360524 0.053447 0.168616 0.012270 -0.340834 -0.270881 0.207575 0.253946 -0.235421 -0.096723 0.117682 0.105696
1716.lowfreq: -6.2735 -0.0002 0.0002 0.0002 0.4654 2.8586 37.2425 43.8708 55.2616
frequency: 37.2268 43.8630 55.2611 69.2605 76.9742 104.6467 127.7962 144.5899 150.7274 163.2664 167.4852 181.1693 199.7259 247.2877 251.2592 269.8293 288.9433 293.1948 301.5353 307.0878 312.9214 340.0646 357.2239 368.8478 380.2727 392.0030 407.8895 441.9000 463.3860 475.3213 518.0859 539.2156 558.6588 565.5138 580.9661 595.6259 613.9171 655.7127 671.4864 687.8192 713.6418 764.3386 778.2266 794.8954 813.1605 821.8144 839.1357 854.9876 861.4238 892.5476 899.4972 909.4634 916.8986 944.7454 953.0573 976.9147 992.4064 1005.7626 1028.9996 1032.3799 1084.9760 1087.1042 1112.7065 1118.6182 1126.3773 1145.2986 1160.8150 1171.4442 1175.4335 1190.7371 1200.4456 1221.9589 1232.7116 1249.0366 1268.7625 1281.2278 1292.0683 1295.9400 1316.4460 1328.5489 1338.3895 1342.9046 1345.8418 1384.9734 1402.2134 1424.8570 1443.7265 1447.2840 1448.5950 1466.2020 1471.3573 1475.5731 1483.3992 1486.6706 1488.0721 1490.6468 1496.7721 1503.9526 1504.8758 1513.5037 1518.1548 1518.5468 1529.7413 1540.6298 1644.2116 1659.0485 1663.5116 1683.8121 2962.2026 2974.2914 3002.1165 3007.9723 3038.4075 3055.1428 3077.5452 3080.8071 3084.1717 3089.0280 3118.9255 3123.7569 3128.2623 3132.3044 3134.8332 3136.4413 3142.9318 3175.9323 3180.9708 3194.2005 3200.7363 3220.0668 3221.3907 3228.2170
redmass: 2.9739 3.3623 3.2030 2.9487 1.7094 2.3857 1.9930 2.4992 1.6069 1.9497 1.9940 2.5354 1.7852 1.4699 2.7197 2.2374 1.9225 2.5066 1.8568 1.4738 3.4134 2.3618 3.0345 1.9127 3.0878 3.0623 2.3726 3.8205 3.3628 3.1421 3.9401 4.9629 3.6380 3.8966 3.9200 4.1829 4.3823 4.5891 1.5015 5.1441 2.9204 1.5544 1.9540 3.2142 2.1925 3.6607 4.3356 1.4238 3.0900 2.3838 5.2662 1.4400 2.1514 1.6761 1.4788 1.9890 1.3097 1.3338 1.8138 1.5801 2.5584 1.4386 2.2104 1.6969 1.5397 2.2550 2.0675 2.4244 1.4585 2.2716 1.3258 1.5274 2.2080 3.3095 3.5067 2.8469 2.5938 2.7317 2.3635 1.6622 3.3127 1.6485 4.7094 2.9784 1.2351 1.2419 1.1002 1.0727 1.1725 2.3348 1.1272 1.2129 1.0511 1.1200 1.1409 1.0616 1.1065 1.0821 1.2024 1.8404 1.2704 1.8034 1.2455 2.2034 5.4653 6.4047 7.6072 8.1382 1.0567 1.0569 1.0485 1.0470 1.0343 1.0365 1.0855 1.0844 1.0769 1.0835 1.1035 1.1026 1.1029 1.1010 1.1035 1.1031 1.0991 1.0970 1.0874 1.0881 1.0920 1.0943 1.0915 1.0944
irintensity: 0.1129 0.2023 0.6829 1.7938 1.4962 2.2560 0.2669 0.3136 0.2622 1.3059 2.3594 0.0887 1.4809 0.3495 0.9946 0.6367 0.7727 2.0439 0.5497 0.1050 4.8935 1.7562 0.5508 2.2442 1.7411 0.2227 1.1574 6.4106 5.1932 1.9629 1.5745 3.0101 0.4046 5.1418 5.5990 5.6087 0.5475 2.2493 1.5458 2.0748 1.3108 45.7139 54.0197 10.0011 22.3528 12.9333 5.1656 2.6932 0.6744 0.6972 40.0658 2.2773 23.4231 0.2951 2.2479 7.9236 0.5702 1.0310 66.2817 34.0348 21.1797 14.6592 9.7771 80.1806 17.3418 21.6306 36.1658 4.5684 26.3568 22.5622 10.1579 21.8442 32.0672 32.3897 133.7030 310.9848 73.6069 57.3926 12.8553 50.2924 76.6162 79.0876 29.3346 79.9116 13.5466 8.8545 33.9744 1.2769 24.6044 292.9385 44.2951 12.5232 1.2182 33.7331 15.9695 15.0333 9.5232 13.3574 29.7412 2.7448 2.4018 6.5656 22.2011 143.6215 52.6383 20.5520 61.1593 7.1475 114.5765 157.6476 14.6888 3.4452 34.3767 25.7356 29.8654 27.4981 35.1803 48.2110 26.2439 31.6621 22.5611 40.7471 23.8206 27.9589 9.0798 5.7863 8.1381 10.0337 18.8437 19.9418 10.3644 15.0270
temp: 298.150 k
press: 1.00000 atm
elementType: 6 6 6 6 6 6 1 1 1 6 8 6 1 1 1 6 1 1 1 6 6 6 6 6 1 6 1 1 5 7 6 1 1 1 6 1 1 1 6 1 1 1 6 1 1 1
symmnumber: 1
zpe: 1026940.5 jmol-1
zpe.correction: 0.391141 hartree
zpe.thermalcorrener: 0.412798 hartree
zpe.thermalcorrenthalpy: 0.413742 hartree
zpe.thermalcorrgfe: 0.341908 hartree
zpe.sumelectzpe: -892.871312 hartree
zpe.sumelectthermal: -892.849655 hartree
zpe.sumelectthermalent: -892.848711 hartree
zpe.sumelectthermalfe: -892.920545 hartree
dipole: -0.4592 0.6709 -0.2662
dipole: 0.8555
quadrupole: -118.1789 -124.0754 -132.4186
quadrupole: 1.9312 4.5690 -3.6906
quadrupole: 6.7121 0.8156 -7.5276 1.9312 4.5690 -3.6906
hfenergy: -893.2624535 hartree
pointgroup: C01 [X(C19H24B1N1O1)]
dipole: -0.1806707 0.2639641 -0.1047179 debye
polarizability: 308.0943692|30.5929794|292.3943806|38.4715241|-53.0573601|248.9808852 unknown
InChI: InChI=1/C19H24BNO/c1-19(2)13-9-7-11-15(20(3)4)17(13)22-18-14(19)10-8-12-16(18)21(5)6/h7-12H,1-6H3
charge 0 multiplicity 1
46 atoms
C  -2.09822866 1.42537309 1.0256151
C  -0.74055509 1.29214707 1.34100925
C  0.18429573 2.2706464 1.00240203
C  -0.24352898 3.44338528 0.39332988
C  -1.59065258 3.65173937 0.10701487
C  -2.47835213 2.61910921 0.40459658
H  -0.39816407 0.38981135 1.83794801
H  1.23531299 2.13142736 1.22848662
H  0.48426199 4.21090321 0.16036075
C  -2.1616496 4.96436369 -0.42017246
O  -3.81582762 2.7759593 0.13271975
C  -1.10674011 5.80163799 -1.14649003
H  -1.5331509 6.74753228 -1.4859275
H  -0.28712988 6.05693894 -0.47193527
H  -0.69633343 5.27338101 -2.01077907
C  -2.69234242 5.77484475 0.78669658
H  -1.87206409 6.01156161 1.47037282
H  -3.14454788 6.7091097 0.4419316
H  -3.44779892 5.21191731 1.33972297
C  -3.34656278 4.6241266 -1.31945076
C  -4.15484485 3.55830707 -0.94382227
C  -3.69131196 5.34502267 -2.46354295
C  -5.32927779 3.2110144 -1.63773001
C  -4.82812781 5.01226393 -3.18128982
H  -3.07394902 6.16913371 -2.79637881
C  -5.6467831 3.9679707 -2.76681229
H  -5.09176026 5.57723843 -4.06823319
H  -6.53839547 3.73654444 -3.33509638
B  -3.07709307 0.22449645 1.317588
N  -6.08745004 2.10236048 -1.22212732
C  -3.02295384 -0.47311632 2.72643981
H  -3.82815841 -0.00250107 3.31270705
H  -3.26147135 -1.54050485 2.69163968
H  -2.10106653 -0.318891 3.29303006
C  -4.04053887 -0.3425177 0.2167553
H  -3.43616421 -1.0713485 -0.34729431
H  -4.88254316 -0.90502998 0.63309992
H  -4.40914578 0.39349276 -0.499621
C  -6.65533078 2.16777571 0.11829883
H  -7.53154898 2.83457814 0.15557919
H  -6.97010386 1.16551302 0.42020616
H  -5.91359735 2.51716552 0.83234375
C  -7.0221871 1.55211772 -2.18191582
H  -7.36141873 0.58057792 -1.81510039
H  -7.91319995 2.18355035 -2.33614755
H  -6.53046605 1.39883464 -3.14417778
