program: Gaussian 16
title: no2_nmeimidazole_2
version: AS64L-G16RevC.02
method: RwB97XD
basis: GenECP
operation: Freq
keyword: #N
keyword: Geom=AllCheck
keyword: Guess=TCheck
keyword: SCRF=Check
keyword: GenChk
keyword: RwB97XD/GenECP
keyword: Freq
converged: YES YES NO YES
title: Mulliken charges:
elementType: C H C N N B C H H H C H N N O O O O
charge: -0.309082 0.256771 -0.478976 0.060466 -0.065471 0.679040 -0.398772 0.189790 0.231155 0.196656 0.029803 0.271297 -0.481140 -0.435465 0.049823 0.092093 0.044453 0.067557
chargesum: -0.00000
title: Mulliken charges with hydrogens summed into heavy atoms:
elementType: C C N N B C C N N O O O O
charge: -0.052310 -0.478976 0.060466 -0.065471 0.679040 0.218829 0.301100 -0.481140 -0.435465 0.049823 0.092093 0.044453 0.067557
chargesum: 0.00000
1716.lowfreq: -16.4080 -13.1543 -11.8328 -0.0006 -0.0005 -0.0004 31.6077 42.6414 48.1102
frequency: 31.5376 42.4784 47.7185 56.8628 76.9627 94.4588 132.6371 163.5434 211.0243 254.5266 265.9493 330.5165 405.2253 557.3017 609.2043 625.4002 645.3598 706.1641 712.7182 771.1916 834.3354 864.7826 893.5660 944.7260 1061.9368 1067.3996 1078.6957 1099.2455 1154.2258 1234.3298 1265.2370 1357.7726 1371.3822 1462.6288 1489.1246 1493.2127 1502.3758 1512.5918 1524.6112 1576.2730 1611.1502 1622.4141 1636.7426 3078.7503 3165.0940 3183.4864 3262.5254 3274.2510
redmass: 12.3052 1.2783 3.7545 7.0620 6.9358 5.8393 12.2582 6.8709 10.7584 5.2210 5.3544 11.9421 3.4073 11.6437 8.3978 4.5627 4.4808 5.2616 5.2382 12.8980 12.9392 1.4389 1.4488 10.9634 4.2026 3.5654 3.8611 1.9578 1.3366 1.9238 1.5353 5.3985 3.8114 1.3898 2.9187 1.0457 1.8938 13.7673 2.6201 5.8108 11.1755 5.3447 14.6600 1.0334 1.1056 1.1062 1.0990 1.1017
irintensity: 0.5783 0.6869 0.9598 1.0414 0.8672 2.2699 10.1274 4.6128 0.7771 1.0034 1.4458 3.4939 1.7667 27.8441 35.8459 44.2406 31.1464 24.2178 1.3726 95.4016 90.5288 0.1378 24.9440 26.2833 60.5365 4.5237 11.4790 33.9728 10.3051 156.8477 16.6657 71.9635 198.5964 18.0174 98.7912 15.2903 60.1874 36.9397 53.6578 34.0299 23.2909 338.7819 859.9589 26.8184 5.4506 3.6785 0.9412 4.8233
temp: 298.150 k
press: 1.00000 atm
elementType: 6 1 6 7 7 5 6 1 1 1 6 1 7 7 8 8 8 8
symmnumber: 1
zpe: 313204.2 jmol-1
zpe.correction: 0.119293 hartree
zpe.thermalcorrener: 0.131882 hartree
zpe.thermalcorrenthalpy: 0.132826 hartree
zpe.thermalcorrgfe: 0.077038 hartree
zpe.sumelectzpe: -699.880464 hartree
zpe.sumelectthermal: -699.867875 hartree
zpe.sumelectthermalent: -699.866931 hartree
zpe.sumelectthermalfe: -699.922720 hartree
dipole: -6.0189 9.3359 -3.2486
dipole: 11.5732
quadrupole: -115.0234 -64.5226 -85.8588
quadrupole: 22.2669 -13.1642 1.5289
quadrupole: -26.5551 23.9457 2.6094 22.2669 -13.1642 1.5289
hfenergy: -699.9997572 hartree
pointgroup: C01 [X(C4H5B1N4O4)]
dipole: -2.367998 3.6730426 -1.2781145 debye
dipolederiv: 0.3903537 -0.514528 0.2729175 -0.5413163 0.7124024 -0.4384946 0.2967857 -0.4314958 0.1892004 0.1570153 0.0274371 -0.0096641 0.0035025 0.1086036 -0.0483428 -0.0201757 -0.0213096 0.1039591 -0.6389606 0.6805029 -0.3351193 0.6911483 -1.0902283 0.5279848 -0.3603592 0.5338556 -0.370881 -0.4200834 0.4159453 -0.1713372 0.2384191 -0.6011268 0.0018134 -0.5031235 0.6055521 -0.5934606 -0.2454714 -0.0732499 0.0652532 0.0593989 -0.4727062 -0.0581374 0.1990023 -0.3297888 -0.1932325 1.0296147 -0.6557628 0.5598783 -0.617758 1.6168299 -0.3041557 0.5899027 -0.4263781 1.2208138 0.3434978 -0.1763707 0.0013612 -0.2753848 0.5996441 -0.1076659 0.0130817 -0.0778411 0.1667488 0.0779972 0.0369334 0.0355091 0.0561097 0.0334503 -0.0023058 -0.0090089 0.0734017 -0.0516001 -0.0779078 0.0707015 0.0217747 0.0028805 -0.0331345 0.0526814 0.054747 0.0084305 0.0920584 0.0357762 -0.0433725 -0.071696 0.0358729 -0.0152624 -0.0137375 -0.0504903 -0.0784469 0.0426754 0.0143389 0.0055072 -0.094504 0.1139584 0.1767999 0.3980106 0.0402559 0.1300447 0.3139995 0.1220355 0.0392407 -0.0499658 0.0453701 0.0944037 0.0280031 -0.0518316 0.0155627 0.0682262 1.8117336 0.1057078 -0.4394853 0.1934532 0.0545094 0.1264123 -0.4116593 0.0264159 0.8915471 1.3077263 0.374837 -0.8274076 0.3287744 0.9092613 -0.2392826 -0.8357896 -0.1527385 0.5956416 -0.7442382 -0.1485402 0.3041332 -0.3996877 -1.0080448 0.3493545 0.3016293 0.040036 -0.4319194 -0.95885 -0.1032877 0.4420478 0.2565457 -0.6051652 -0.0826534 0.5287413 0.0341901 -0.5374082 -1.2844848 -0.0254682 0.1312285 -0.2150773 -0.2624417 -0.0395976 -0.2749404 0.0082054 -0.584047 -0.9200929 -0.0162329 0.165076 0.0237903 -0.2177947 -0.1498868 0.4932329 0.0423041 -0.9223216 unknown
polarizability: 118.3759462|-26.8036207|128.7779438|12.197886|-9.4441294|118.1282935 unknown
InChI: InChI=1/C4H5BN4O4/c1-7-2-4(6-3-7)5(8(10)11)9(12)13/h2-3H,1H3
charge 0 multiplicity 1
18 atoms
C  2.71840282 1.63458745 1.08231195
H  2.81718544 2.22382953 1.98115726
C  3.19723441 0.37073324 0.75605107
N  2.03138895 2.06718101 0.01102667
N  2.78338971 0.04664017 -0.53211448
B  4.00875583 -0.53530962 1.60446052
C  1.29656336 3.31857506 -0.11343168
H  1.33131383 3.65071826 -1.14986877
H  0.25907532 3.17854965 0.19152268
H  1.76490707 4.07248171 0.51648803
C  2.09852097 1.06911203 -0.9376043
H  1.62056813 1.17663202 -1.90064545
N  4.52001881 -0.13565975 2.98944082
N  4.41000308 -1.94333872 1.18497783
O  3.68882752 -2.83931733 1.5894315
O  5.39661044 -2.08462828 0.49236092
O  5.71594013 0.07535057 3.08501092
O  3.71124919 -0.028614 3.89306351
