program: Gaussian 16
title: no2_quinoline
version: AS64L-G16RevC.02
method: RwB97XD
basis: GenECP
operation: Freq
keyword: #N
keyword: Geom=AllCheck
keyword: Guess=TCheck
keyword: SCRF=Check
keyword: GenChk
keyword: RwB97XD/GenECP
keyword: Freq
converged: YES YES YES YES
title: Mulliken charges:
elementType: C C C C C C H C H H C C H H H N B N N O O O O
charge: -0.133384 -0.275586 -0.980863 0.575417 -0.472342 -0.457539 0.277288 0.769941 0.219152 0.255407 -0.709095 0.051921 0.260352 0.247112 0.269080 0.161491 0.661362 -0.612427 -0.627724 0.144479 0.124329 0.134653 0.116976
chargesum: -0.00000
title: Mulliken charges with hydrogens summed into heavy atoms:
elementType: C C C C C C C C C N B N N O O O O
charge: 0.143904 -0.275586 -0.980863 0.575417 -0.253190 -0.202131 1.030293 -0.461982 0.321001 0.161491 0.661362 -0.612427 -0.627724 0.144479 0.124329 0.134653 0.116976
chargesum: 0.00000
1716.lowfreq: -7.7148 -4.9080 -0.0007 -0.0007 -0.0006 1.9639 18.9636 43.5055 61.0548
frequency: 18.5547 43.4073 61.0504 95.6063 104.6460 145.6242 146.2765 158.0079 183.1401 200.0599 218.8058 304.8215 408.3647 432.0569 475.2297 505.1032 535.4875 541.8340 571.7024 598.6809 618.7331 664.9987 688.0682 764.3371 787.3912 808.4500 820.2043 833.6896 858.6633 877.7661 965.8730 972.4110 998.4894 1021.4313 1032.6388 1058.6302 1064.2298 1113.7041 1144.5885 1169.3765 1230.5874 1247.6548 1285.9955 1327.1031 1360.0990 1408.0479 1437.6396 1465.4705 1509.9713 1516.7301 1544.3564 1560.1708 1611.3738 1641.4382 1642.4321 1659.6171 1689.7137 3180.2822 3193.0419 3197.0659 3200.1216 3225.6838 3226.7741
redmass: 8.4776 15.5212 7.3415 13.0791 8.9226 7.9734 12.5213 9.5644 4.9322 9.8690 4.7238 10.6392 4.3172 4.6813 3.1427 3.8979 8.1874 7.6567 12.4135 9.5743 4.2946 4.2787 8.4454 12.0959 1.3162 9.5857 2.0402 5.6647 2.3375 8.9522 7.4438 1.3958 1.3915 1.3635 1.3730 6.2015 3.1074 2.5825 2.3175 1.2558 1.4401 2.2678 1.7386 2.8926 3.1684 4.3499 2.8084 1.9379 10.9337 3.2204 6.0448 5.3904 14.6340 6.3052 14.5919 5.4002 6.7151 1.0911 1.0900 1.0911 1.0919 1.0970 1.0976
irintensity: 0.1008 0.0090 0.1371 0.9752 0.2006 1.6236 10.1946 2.0497 5.1164 0.5834 2.5307 0.1924 0.2677 5.4092 0.4683 9.6162 22.1377 8.7638 25.7860 115.0612 3.8673 2.3660 6.6442 70.4708 5.1131 11.8531 74.8526 0.3431 27.7320 37.4496 7.0731 1.5399 0.1798 0.0393 0.6564 23.7616 20.7986 41.8969 23.5581 19.4320 41.4552 15.0912 29.0242 407.0060 54.9546 26.0823 6.0793 12.0760 61.5530 29.7676 21.8800 75.8218 26.2582 242.9098 849.5616 33.3613 71.9801 16.3249 1.6610 5.3372 2.7375 7.8287 8.6521
temp: 298.150 k
press: 1.00000 atm
elementType: 6 6 6 6 6 6 1 6 1 1 6 6 1 1 1 7 5 7 7 8 8 8 8
symmnumber: 1
zpe: 408964.4 jmol-1
zpe.correction: 0.155766 hartree
zpe.thermalcorrener: 0.169754 hartree
zpe.thermalcorrenthalpy: 0.170698 hartree
zpe.thermalcorrgfe: 0.112488 hartree
zpe.sumelectzpe: -836.207066 hartree
zpe.sumelectthermal: -836.193078 hartree
zpe.sumelectthermalent: -836.192134 hartree
zpe.sumelectthermalfe: -836.250344 hartree
dipole: -4.1075 9.4021 0.6375
dipole: 10.2799
quadrupole: -73.7829 -86.6010 -104.3750
quadrupole: -18.2043 -3.4960 -1.0528
quadrupole: 14.4700 1.6520 -16.1220 -18.2043 -3.4960 -1.0528
hfenergy: -836.3628321 hartree
pointgroup: C01 [X(C9H6B1N3O4)]
dipole: -1.6159976 3.6990637 0.2507943 debye
dipolederiv: 0.165052 -0.8521746 -0.0311472 0.0308444 0.527106 -0.00368 -0.045154 0.1294886 -0.0377623 -0.6713948 0.929969 0.076879 0.4325651 -1.2418901 -0.0757242 0.0843153 -0.154925 -0.1831833 0.245738 0.4194076 -0.0192236 -0.0511957 0.4069565 0.0079232 -0.0209466 -0.0724827 0.1415358 -0.461466 0.0102411 0.0876795 0.0076808 -0.2641818 -0.0007112 0.0889906 -0.0008039 0.0210147 0.3884558 0.3671772 -0.0834294 0.0537143 0.4138291 -0.0117728 -0.0833213 -0.069625 -0.0614545 0.1006036 -0.0418733 -0.0464314 -0.1514196 -0.9487463 0.0297972 -0.0449611 0.0167063 -0.1332637 0.0913973 -0.0559503 0.0019929 -0.0689006 -0.004887 0.0094582 0.0101283 0.0015654 0.1159244 0.4076358 -0.0137956 -0.0889757 0.1466632 0.3047092 -0.027158 -0.0899521 0.0033759 -0.0744191 0.0582638 0.0319634 0.0142884 0.089788 -0.0211627 -0.0158206 0.0151691 -0.0077382 0.1377637 -0.0547453 0.0070051 0.0390031 -0.0056696 0.0793808 0.0018482 0.0408377 0.0016584 0.1553435 -0.5428381 0.0909349 0.0726263 0.3360054 -0.0039144 -0.0601012 0.0722574 -0.0195922 -0.1420654 0.5009681 -0.003098 -0.0832854 -0.3894331 0.4855266 0.066764 -0.0817911 0.0009512 0.0562074 0.0475728 0.0930034 0.0163847 0.0404061 -0.0113121 -0.0064947 0.0160232 -0.0149437 0.1389629 0.056098 -0.0725959 0.0188963 -0.0746372 -0.0235409 0.0144229 0.0192124 0.0138108 0.1570494 -0.0854297 -0.0406363 0.0358916 0.0025106 0.0766097 -0.0006695 0.0362967 0.0088289 0.1078694 -0.4259798 -0.3278176 0.0289904 -0.0201083 -0.7364118 0.009281 0.0258162 0.0626189 -0.262066 1.2554285 -0.6655602 -0.0942639 -0.4748158 2.2028911 0.081476 -0.0850594 0.1220871 0.4698336 0.6750895 -0.1827459 0.1424098 -0.1410946 0.1987067 0.0275302 0.1213419 0.042866 1.9027685 0.1825031 0.3512262 0.063374 0.2641027 0.6208637 0.0294749 0.0726093 0.0439772 1.9325383 -0.5829795 0.2092021 0.3887353 0.1036641 -0.3301883 -0.1195109 0.041962 -0.0998017 -1.1710573 -0.7328941 0.2227901 -0.4845711 0.1196919 -0.3284299 0.07779 -0.1356128 0.016028 -1.0511939 -0.2937352 -0.2187938 0.2032312 -0.1094016 -0.6826088 0.3769737 0.0011945 0.0704148 -1.1389294 -0.3233438 -0.2578786 -0.2590549 -0.1409605 -0.7193053 -0.4110962 -0.0593562 -0.0944652 -1.0814167 unknown
polarizability: 206.3212332|10.4678238|222.5524973|-18.1957562|-1.2443694|120.5397172 unknown
InChI: InChI=1/C9H6BN3O4/c14-12(15)10(13(16)17)8-5-1-3-7-4-2-6-11-9(7)8/h1-6H
charge 0 multiplicity 1
23 atoms
C  -4.00251856 0.02769258 0.29847713
C  -2.63512429 0.05194233 0.05090482
C  -1.97665416 1.32113119 -0.0725749
C  -2.7339963 2.51025157 0.05890981
C  -4.12476404 2.42509694 0.30914431
C  -4.74851782 1.20985735 0.42747495
H  -4.52066123 -0.91938477 0.40411549
C  -2.05416003 3.74470114 -0.06862218
H  -4.69397894 3.34384252 0.4070831
H  -5.81238458 1.15483455 0.62048152
C  -0.70954161 3.74070966 -0.31044306
C  -0.04756777 2.49812245 -0.4240507
H  -2.60729186 4.67296177 0.02708248
H  -0.14875819 4.66072236 -0.41504432
H  1.02151892 2.47237934 -0.61548366
N  -0.64477302 1.33620506 -0.31261848
B  -1.88326047 -1.25043733 -0.07432985
N  -0.38815895 -1.45922736 -0.27583165
N  -2.61564651 -2.59297973 0.00575782
O  0.02396586 -1.57131683 -1.41213392
O  0.27740903 -1.55188499 0.73884468
O  -2.84923112 -3.04419179 1.11183141
O  -2.93076047 -3.1096588 -1.05045886
