program: Gaussian 16
title: MeQHBPh2
version: ES64L-G16RevC.01
method: RwB97XD
basis: GenECP
operation: Freq
keyword: #N
keyword: Geom=AllCheck
keyword: Guess=TCheck
keyword: SCRF=Check
keyword: GenChk
keyword: RwB97XD/GenECP
keyword: Freq
converged: YES YES NO YES
title: Mulliken charges:
elementType: C H C N N N B C H H H C C C C C C C C C C C C H H H H H H H H H H
charge: -0.489239 0.265679 -0.777900 0.278409 0.108374 -0.142233 0.518163 -0.366650 0.210205 0.197700 0.205073 0.102151 0.115610 -0.182384 -0.317771 -0.377454 -0.423973 0.359516 0.040633 -0.130145 -0.525555 -0.431549 -0.489769 0.240956 0.209882 0.210557 0.241718 0.217485 0.211176 0.234552 0.210398 0.241400 0.234985
chargesum: -0.00000
title: Mulliken charges with hydrogens summed into heavy atoms:
elementType: C C N N N B C C C C C C C C C C C C C
charge: -0.223560 -0.777900 0.278409 0.108374 -0.142233 0.518163 0.246328 0.102151 0.357010 0.028792 -0.082786 -0.142902 -0.213576 0.359516 0.258118 0.079737 -0.283836 -0.190593 -0.279211
1716.lowfreq: -4.3940 -0.0005 -0.0002 0.0005 1.0784 11.2895 34.2133 38.1470 49.4448
frequency: 34.1774 38.0265 49.4273 60.6292 68.0942 77.7963 91.9503 163.6425 194.5988 200.3614 256.4345 269.6443 286.5132 292.4830 404.7279 413.7102 419.6940 440.6909 480.8949 617.1802 629.2405 636.0927 638.6707 664.8137 681.7321 716.7689 718.9465 726.7571 745.0739 769.6275 793.7157 875.0014 881.4695 884.5324 887.5033 910.0094 964.2811 967.7209 1016.6591 1018.1883 1021.2749 1023.2179 1029.7340 1030.6714 1034.2623 1060.2912 1065.2977 1072.5989 1092.9758 1111.0959 1115.9122 1154.5079 1155.7831 1186.4810 1187.3504 1218.2107 1222.2853 1227.8938 1271.2063 1291.2236 1309.1602 1314.3082 1326.9182 1360.8770 1365.6337 1407.6658 1455.0053 1470.9852 1475.7894 1489.6411 1490.4044 1528.8010 1533.9376 1536.9954 1564.1397 1636.6418 1638.4389 1668.7308 1669.6585 3075.0010 3157.5536 3178.1214 3180.3262 3182.0251 3186.2121 3188.1327 3191.1710 3198.0969 3199.9708 3208.3606 3210.7362 3222.0003 3288.3193
redmass: 4.1963 1.1888 2.9838 4.6163 4.6855 3.9666 5.1266 4.2319 4.8313 4.3647 5.7803 5.4175 5.2229 5.2218 3.3073 2.9823 2.8959 3.9486 3.6775 6.4795 4.9961 6.3564 5.8855 5.9289 4.6687 2.0507 2.9235 1.6791 5.1738 1.9165 2.4671 1.4754 1.3315 2.9430 1.4575 5.5197 1.3984 1.3823 1.4286 1.4432 5.6745 4.6975 1.3745 1.3327 2.9346 2.7279 2.1028 2.8989 2.1710 1.6348 1.6437 1.4396 1.9281 1.1359 1.1316 1.1578 1.2099 2.7871 4.6581 3.5621 4.9449 4.2030 6.1539 1.4964 1.4544 6.4984 1.3485 2.1214 2.1770 1.4439 1.0897 2.0695 2.2933 2.2811 5.1935 5.1683 5.2429 5.6899 5.6762 1.0333 1.1064 1.0858 1.0857 1.0876 1.1046 1.0890 1.0914 1.0932 1.0952 1.0975 1.0994 1.0946 1.1011
irintensity: 1.2732 1.7339 7.5349 0.9633 0.4946 1.7234 5.1072 1.2034 0.3418 3.5129 0.2452 1.5965 1.4334 0.5151 9.1136 1.6911 1.6943 1.4589 0.0597 14.6684 18.6098 1.5530 1.1732 12.8506 22.0019 46.2980 29.1076 49.8998 29.1372 44.9151 16.4760 18.1479 4.0197 55.0248 20.6870 42.3222 0.9222 0.4231 2.2357 1.8594 1.3140 1.2825 0.8062 0.3379 13.8840 3.0050 4.3681 13.8634 26.1919 6.4038 3.7800 3.9007 7.9216 0.9154 1.8823 7.2901 12.0844 144.5465 160.0713 139.1659 61.8686 43.4920 114.3447 3.9988 7.7851 24.3378 3.7948 17.9187 26.2520 35.7496 20.5955 4.8769 0.3751 4.4674 178.9312 2.0908 5.1785 23.3737 50.4371 39.1537 8.6227 4.1915 1.3340 2.9397 1.3301 2.9849 8.5800 27.8928 37.9260 30.8554 22.7148 10.6843 1.3202
temp: 298.150 k
press: 1.00000 atm
elementType: 6 1 6 7 7 7 5 6 1 1 1 6 6 6 6 6 6 6 6 6 6 6 6 1 1 1 1 1 1 1 1 1 1
symmnumber: 1
zpe: 696642.4 jmol-1
zpe.correction: 0.265337 hartree
zpe.thermalcorrener: 0.281245 hartree
zpe.thermalcorrenthalpy: 0.282189 hartree
zpe.thermalcorrgfe: 0.219491 hartree
zpe.sumelectzpe: -768.785306 hartree
zpe.sumelectthermal: -768.769398 hartree
zpe.sumelectthermalent: -768.768454 hartree
zpe.sumelectthermalfe: -768.831152 hartree
dipole: -0.0881 4.0436 3.2020
dipole: 5.1586
quadrupole: -105.8990 -85.7848 -107.8528
quadrupole: 8.8562 13.4785 3.5609
quadrupole: -6.0535 14.0607 -8.0072 8.8562 13.4785 3.5609
hfenergy: -769.0506431 hartree
pointgroup: C01 [X(C15H14B1N3)]
dipole: -0.0346591 1.5908842 1.2597585 debye
polarizability: 209.5973422|-1.8070449|291.6314616|60.865744|11.3083516|219.7544776 unknown
InChI: InChI=1/C15H14BN3/c1-19-12-15(17-18-19)16(13-8-4-2-5-9-13)14-10-6-3-7-11-14/h2-12H,1H3
charge 0 multiplicity 1
33 atoms
C  2.7816769 1.64848598 1.16889531
H  3.01756027 2.21532554 2.05470403
C  3.11582287 0.36168019 0.78106192
N  2.02011107 2.13838216 0.18196819
N  1.87757364 1.22301233 -0.7969021
N  2.51917361 0.16500767 -0.44422128
B  3.95966111 -0.68577491 1.55563796
C  1.40452122 3.44621987 0.06022334
H  0.76692447 3.42681679 -0.82103767
H  0.80214797 3.65607098 0.94387387
H  2.1697088 4.21391646 -0.05902056
C  3.90537041 -2.20717017 1.21084467
C  2.79501462 -2.78770989 0.57493682
C  4.98251046 -3.0513649 1.53084151
C  2.75549144 -4.14608801 0.28897179
C  4.95869291 -4.40608885 1.22598413
C  3.83968444 -4.95674696 0.60990161
C  4.86192201 -0.16775689 2.7325507
C  4.93102246 -0.86387389 3.94942252
C  5.62066233 1.00732907 2.6166652
C  5.70237132 -0.3987871 5.00749272
C  6.41950178 1.46097114 3.65973652
C  6.45425273 0.76243699 4.86189175
H  7.0122428 2.36101213 3.53728664
H  5.60241339 1.56538659 1.68564778
H  7.06811053 1.11972991 5.68153786
H  5.72540631 -0.94675947 5.94314252
H  4.3623238 -1.78027154 4.07140159
H  5.85912303 -2.63512583 2.01634189
H  5.80861616 -5.0335182 1.47113423
H  3.8135603 -6.01611788 0.37775493
H  1.95436229 -2.16284809 0.29889958
H  1.8830514 -4.57271058 -0.1936495
