program: Gaussian 09
title: 000075831
version: EM64L-G09RevD.01
frameworkgroup: C1[X(C7H5BrO2)]
method: RPBEPBE
basis: SDD
operation: Freq
keyword: #p
keyword: freq=noraman
keyword: PBEPBE/SDD
title: #p freq=noraman PBEPBE/SDD
converged: NO YES NO YES
title: Mulliken charges:
elementType: Br O O C C C C C C C H H H H H
charge: 0.010646 -0.263323 -0.262416 0.221524 0.186123 -0.199849 -0.289314 -0.316974 -0.192288 -0.163349 0.240898 0.240944 0.275725 0.258974 0.252679
chargesum: 0.00000
title: Mulliken charges with hydrogens summed into heavy atoms:
elementType: Br O O C C C C C C C
charge: 0.010646 -0.263323 -0.262416 0.221524 0.186123 0.281993 -0.013589 -0.058000 -0.192288 0.089330
polarizability: 1.52586153e+02 1.83640544e+00 8.76261539e+01 1.25966472e-02 -3.71344140e-03 3.95279432e+01
1716.lowfreq: -56.2134 -4.1574 0.0006 0.0006 0.0007 5.8779 10.9624 108.4688 182.1389
frequency: -56.1528 108.4661 182.1386 216.0556 264.6621 299.2282 411.5050 415.0195 555.6459 564.2117 642.8626 681.7460 703.5881 773.6247 801.2159 826.6273 853.1704 859.3576 924.9864 975.9640 1040.8023 1064.7856 1071.2243 1121.4966 1139.7933 1226.5579 1254.8576 1364.7221 1382.1896 1411.8771 1457.6813 1485.7994 1600.7116 1617.4276 3013.7029 3092.2527 3169.9343 3189.2530 3194.1897
redmass: 2.3436 9.8241 8.5340 6.2482 15.4777 8.3222 5.1666 3.0122 6.9754 4.6979 8.5823 9.7665 4.8919 6.6028 1.3409 6.8279 11.3615 1.3809 1.3285 6.7981 2.0137 1.4562 3.9530 1.0361 1.3803 2.7662 1.5075 1.3952 3.8617 3.5475 3.1133 1.1720 7.9791 9.0794 1.0535 1.1191 1.0894 1.0968 1.0943
irintensity: 15.2199 0.1952 0.1780 0.2215 1.1025 0.0442 6.8739 8.3151 10.0284 10.8886 14.7254 1.6588 0.4584 7.5881 52.2527 35.8313 32.9052 28.7807 1.0974 149.8829 4.6840 4.4167 50.1250 0.0017 2.8140 130.4877 57.2218 5.5190 11.8996 24.5201 251.0696 9.5571 9.6620 5.3526 114.5869 31.0624 1.4808 1.8144 0.8888
temp: 298.150 k
press: 1.00000 atm
elementType: 35 8 8 6 6 6 6 6 6 6 1 1 1 1 1
symmnumber: 1
zpe: 268916.5 jmol-1
zpe.correction: 0.102425 hartree
zpe.thermalcorrener: 0.109972 hartree
zpe.thermalcorrenthalpy: 0.110916 hartree
zpe.thermalcorrgfe: 0.068712 hartree
zpe.sumelectzpe: -432.903044 hartree
zpe.sumelectthermal: -432.895497 hartree
zpe.sumelectthermalent: -432.894553 hartree
zpe.sumelectthermalfe: -432.936758 hartree
dipole: -2.2711 0.3052 0.0018
dipole: 2.2915
quadrupole: -59.7435 -63.9049 -68.7788
quadrupole: 3.4403 -0.0063 -0.0010
quadrupole: 4.3989 0.2375 -4.6364 3.4403 -0.0063 -0.0010
hfenergy: -433.0054691 hartree
pointgroup: C01 [X(C7H5Br1O2)]
dipole: 0.8784232 0.2029327 -0.0007015 debye
dipolederiv: -0.6393952 -0.1535262 -0.0001027 -0.1733259 -0.1126168 -0.0000307 -0.0001254 -0.0000402 -0.034843 -1.3471228 0.2299325 0.0001249 0.3377822 -0.519001 0.0000698 -0.0001904 0.0001087 -0.2508006 -1.465463 0.1094355 0.0000507 0.0890117 -0.4320383 -0.0001486 -0.000328 -0.0000518 -0.2510474 0.7699584 -0.3153236 0.000192 -0.8248642 0.3144559 -0.0000275 0.0002936 -0.00005 0.0512344 1.1644834 -0.0228949 0.0002261 0.484246 -0.1144982 -0.0000558 0.0004786 -0.000097 0.0418559 1.2019407 -0.1293166 -0.0005309 -0.1620298 0.5674622 0.0001224 -0.0007035 0.0001364 0.5756913 -0.3791627 0.0815991 -0.0001009 -0.1219898 -0.0107523 -0.0000066 -0.0000844 -0.0000069 -0.1133658 -0.0142686 -0.0352539 -0.0000415 0.0197657 0.0718394 0.0000419 0.0000106 0.0000415 -0.1568265 1.0792094 0.2295104 0.0002466 0.4310324 0.1636567 0.0000314 0.0002679 0.000099 -0.1428744 -0.367843 -0.0705269 0.0000041 -0.160117 -0.0725613 0.0000098 -0.0000711 -0.0000429 -0.1252792 -0.0947836 0.0333588 0.0631585 0.0377748 0.0577895 -0.0150194 0.162154 -0.0363074 -0.0685353 -0.094956 0.0334439 -0.0631722 0.0378605 0.0579166 0.0150445 -0.1616825 0.0362402 -0.0679158 0.1097162 -0.0177839 -0.000013 -0.0193299 0.0086783 -0.0000105 -0.0000009 -0.0000201 0.1853583 0.0637804 -0.0492821 -0.0000217 -0.0438785 -0.0219657 -0.0000247 -0.0000032 -0.0000195 0.1841567 0.0139063 0.0766279 -0.0000198 0.0680617 0.0416349 0.0000039 -0.0000151 0.0000101 0.1731916 unknown
polarizability: 152.361568|4.2321395|87.8507392|0.0121951|0.0048729|39.5279432 unknown
InChI: InChI=1S/C7H5BrO2/c8-5-1-2-6-7(3-5)10-4-9-6/h1-3H,4H2
charge 0 multiplicity 1
15 atoms
Br -3.709581 -0.670904 -0.000518
O  1.665824 -1.45839 0.000528
O  2.223893 0.880317 0.000746
C  0.492302 -0.669196 0.000188
C  0.818978 0.705313 0.000306
C  2.798414 -0.491847 -0.000181
C  -0.828755 -1.123409 -0.000025
C  -0.165613 1.695224 0.000229
C  -1.826583 -0.112998 -0.000133
C  -1.522441 1.263921 0.000003
H  3.389696 -0.633777 -0.921264
H  3.391315 -0.634328 0.919743
H  -1.07324 -2.187328 -0.000099
H  0.089505 2.757481 0.000361
H  -2.326613 2.004123 -0.000085
