program: Gaussian 16
title: Me_bicyclo-H+
version: ES64L-G16RevC.01
method: RwB97XD
basis: GenECP
operation: Freq
keyword: #N
keyword: Geom=AllCheck
keyword: Guess=TCheck
keyword: SCRF=Check
keyword: GenChk
keyword: RwB97XD/GenECPFreq
converged: YES YES YES YES
title: Mulliken charges:
elementType: C C C C C C H H H H N C H H H C H H H H B C C C H C C H C C H H H H C H H H H H H H H
charge: -0.669830 -0.264436 0.429130 0.139696 -0.316490 -0.365542 0.261724 0.259560 0.228750 0.273935 -0.017409 -0.384283 0.228530 0.250472 0.254062 -0.382475 0.237345 0.250767 0.260194 0.402161 -0.433470 0.162357 0.138945 -0.471806 0.226957 -0.631879 -0.338371 0.216923 -0.628628 -0.388079 0.231812 0.206501 0.168395 0.206906 -0.312673 0.230001 0.144691 0.212792 0.217162 0.225569 0.157203 0.149322 0.233509
chargesum: 1.00000
title: Mulliken charges with hydrogens summed into heavy atoms:
elementType: C C C C C C N C C B C C C C C C C C
charge: -0.408105 -0.004877 0.429130 0.139696 -0.087740 -0.091607 0.384753 0.348781 0.365831 -0.433470 0.389314 0.355869 -0.033493 -0.256578 0.036321 -0.198675 -0.005308 0.070158
1716.lowfreq: -24.0807 -17.3362 -0.0004 0.0003 0.0003 16.3061 38.0316 56.2857 89.9019
frequency: 35.1019 54.5469 89.7524 103.6866 126.5824 143.8742 170.6132 185.5937 226.3748 240.8444 256.4642 277.2949 294.5705 311.7240 335.0064 345.6420 348.8784 381.8958 395.6846 460.7803 498.9085 511.0791 539.5522 562.3840 588.9966 609.5675 661.7073 693.3335 735.3780 769.0014 770.7076 787.4451 792.5335 794.3618 839.8307 857.8766 888.8154 902.6858 914.5893 923.1575 943.0445 946.9279 970.9763 1004.3831 1019.5349 1020.0934 1034.3607 1037.8964 1068.3690 1071.8082 1083.6658 1098.4154 1108.7046 1123.2157 1124.9480 1143.6316 1154.8183 1163.6866 1179.1887 1187.6215 1195.9486 1200.2092 1209.9454 1235.9402 1266.6016 1279.0278 1285.8099 1291.1193 1301.0027 1304.8865 1333.3731 1336.6093 1350.8947 1359.7148 1368.3502 1387.0286 1392.4560 1397.5993 1403.1633 1414.3983 1440.3208 1450.3647 1467.6048 1480.3643 1482.0235 1490.1667 1494.3742 1496.2682 1501.9365 1506.2792 1509.9090 1512.3622 1528.2812 1535.5959 1540.6548 1548.6808 1640.6341 1686.4783 2978.6450 3000.3812 3011.2087 3020.6523 3028.2342 3061.4407 3065.0446 3066.8192 3069.2930 3072.2249 3075.1759 3076.9983 3085.9706 3090.9510 3117.3970 3144.1058 3188.5082 3192.4176 3198.6590 3200.4473 3201.8435 3207.3200 3217.2737 3228.7209 3447.2311
redmass: 3.5293 3.2753 3.4899 2.7511 2.9073 3.6385 2.8937 3.2685 2.0754 2.5306 1.8493 1.2004 1.4604 4.1734 2.4409 2.9863 3.0072 1.7509 2.9021 3.3200 2.1186 3.7339 3.9387 3.1954 4.3451 3.5380 4.2670 3.7783 1.6754 3.6285 3.5238 2.1233 3.1769 1.6434 2.8926 1.4006 1.9587 2.5562 1.4972 1.4810 2.9802 2.4481 3.6869 1.3931 1.8969 1.7815 1.8689 1.5068 2.1136 2.2754 1.2099 1.8998 2.0797 1.9954 2.0007 1.4879 1.5435 1.3313 1.3995 1.3399 1.8562 1.1805 1.6054 1.6745 1.3520 1.6778 1.6307 1.4208 1.3744 1.7129 1.2715 2.9062 1.5293 1.3452 1.4685 1.4875 1.3293 1.4295 1.4698 1.5118 1.2678 1.2553 1.1618 1.2369 1.0870 1.0773 1.0535 1.8048 1.0892 1.1122 1.0432 1.0712 1.5306 1.1160 1.1752 1.2245 5.5141 5.7751 1.0799 1.0723 1.0670 1.0654 1.0639 1.0856 1.0799 1.0934 1.0906 1.0899 1.0857 1.0855 1.0314 1.0319 1.0996 1.0907 1.1085 1.1082 1.1041 1.0938 1.1045 1.0941 1.0944 1.0993 1.0764
irintensity: 0.6565 1.5372 0.0911 2.1244 3.0569 4.6443 4.6709 0.8288 0.4870 0.4929 0.2547 0.4175 0.2886 0.2763 1.1435 1.1471 1.0938 0.2615 1.4247 2.4865 1.2443 7.4468 4.7128 16.8427 1.2874 3.2895 0.5259 27.7241 2.4449 1.5343 5.6399 16.5228 2.9572 33.7970 0.6525 0.0264 0.5068 2.7538 5.3050 8.3847 21.7083 4.5405 63.9040 0.6639 0.9067 1.1693 12.3822 9.0515 20.8146 7.9942 4.1624 1.1016 31.5022 0.9506 10.0006 3.7227 9.0293 3.1592 3.8512 2.5872 3.1482 2.7039 22.8640 23.2261 0.7874 85.6376 19.1780 42.1019 13.8301 7.9558 3.6249 4.0596 14.2258 3.1541 70.3434 9.2975 2.6170 0.6613 5.4005 25.5860 20.1471 11.8311 6.1328 5.6548 3.4265 6.1150 3.0311 13.2471 6.1705 15.2859 33.7105 23.9987 21.3178 11.6184 29.0989 8.3608 5.8734 52.8633 42.6472 128.2605 43.9668 39.3733 50.9174 62.9006 18.4740 31.4428 64.8027 14.7469 43.1904 43.7804 2.4711 2.2694 45.4857 50.1631 0.5695 4.3514 1.2964 1.9073 1.0650 0.6394 5.1428 5.1429 340.5651
temp: 298.150 k
press: 1.00000 atm
elementType: 6 6 6 6 6 6 1 1 1 1 7 6 1 1 1 6 1 1 1 1 5 6 6 6 1 6 6 1 6 6 1 1 1 1 6 1 1 1 1 1 1 1 1
symmnumber: 1
zpe: 1032290.3 jmol-1
zpe.correction: 0.393179 hartree
zpe.thermalcorrener: 0.409618 hartree
zpe.thermalcorrenthalpy: 0.410562 hartree
zpe.thermalcorrgfe: 0.349976 hartree
zpe.sumelectzpe: -703.759782 hartree
zpe.sumelectthermal: -703.743343 hartree
zpe.sumelectthermalent: -703.742399 hartree
zpe.sumelectthermalfe: -703.802985 hartree
dipole: 7.1972 17.8403 -2.8174
dipole: 19.4426
quadrupole: -75.4241 -26.1164 -94.9750
quadrupole: 22.5821 -5.6064 -19.0796
quadrupole: -9.9189 39.3887 -29.4698 22.5821 -5.6064 -19.0796
hfenergy: -704.152961 hartree
pointgroup: C01 [X(C16H25B1N1)]
dipole: -2.0397269 2.2426564 -1.394783 debye
polarizability: 253.1314435|-12.0441688|205.947358|-10.8412331|-24.8971409|198.87836 unknown
InChI: InChI=1/C16H25BN/c1-18(2)16-12-4-3-11-15(16)17-13-7-5-8-14(17)10-6-9-13/h3-4,11-14,18H,5-10H2,1-2H3
charge 1 multiplicity 1
43 atoms
C  -0.52137341 1.62143286 1.84954867
C  0.84403751 1.51404264 1.62384265
C  1.50358732 2.31319128 0.67775888
C  0.70741586 3.24176664 0.00274912
C  -0.64813637 3.39774771 0.23086304
C  -1.26668017 2.56782329 1.15806012
H  -1.00290544 0.9781932 2.57590794
H  1.41788863 0.78587821 2.18626145
H  -1.23183152 4.14572108 -0.29253247
H  -2.32900467 2.67125176 1.34210923
N  1.37743746 4.15284359 -0.9550964
C  0.74238078 4.18837505 -2.30705196
H  -0.21108118 4.70732113 -2.24248054
H  1.4088396 4.72374663 -2.9820613
H  0.59605265 3.1650088 -2.64680914
C  1.57440654 5.52057047 -0.38356536
H  2.12956108 6.1223447 -1.10106987
H  0.59815397 5.9617261 -0.19363946
H  2.12971053 5.42409615 0.54780442
H  2.30644336 3.74679078 -1.09398119
B  3.03491023 2.06215376 0.42424289
C  4.02890145 1.68873518 1.57299601
C  3.76989322 2.12240757 -0.97313479
C  5.02893837 2.87840963 1.62199189
H  3.5464176 1.63810223 2.55421178
C  4.67298257 0.30846698 1.29283636
C  4.92130811 3.16182267 -0.93513518
H  3.13361983 2.35440067 -1.84108778
C  4.23694443 0.65632212 -1.21669499
C  5.80528548 3.11848077 0.3222769
H  5.73474887 2.72002797 2.44405786
H  4.46950975 3.7893773 1.87969208
H  3.91508177 -0.45346868 1.51063169
H  5.49152437 0.13356977 1.99960926
C  5.17474654 0.09344442 -0.14382889
H  5.54230115 3.04970176 -1.83039078
H  4.48468881 4.16982675 -1.0059223
H  3.34447661 0.02058138 -1.28416831
H  4.72275901 0.60217867 -2.19657611
H  6.34687225 4.06577004 0.40126271
H  6.57229556 2.35221092 0.21148581
H  6.16892485 0.52309496 -0.26930129
H  5.29585004 -0.97964642 -0.31824135
