program: Gaussian 16
title: Me_Borole-H+
version: ES64L-G16RevC.01
method: RwB97XD
basis: GenECP
operation: Freq
keyword: #N
keyword: Geom=AllCheck
keyword: Guess=TCheck
keyword: SCRF=Check
keyword: GenChk
keyword: RwB97XD/GenECPFreq
converged: YES YES YES YES
title: Mulliken charges:
elementType: C C C C C H H H H N C H H H C H H H C B C C C H C H H H H
charge: -0.433012 -0.149812 0.181380 -0.287715 -0.498952 0.264878 0.256247 0.229823 0.272697 -0.019869 -0.348515 0.245520 0.234479 0.230652 -0.435360 0.245595 0.231688 0.248651 0.060508 0.250277 -0.860491 -0.218939 0.383621 0.192534 -0.369338 0.215155 0.276834 0.260539 0.340924
chargesum: 1.00000
title: Mulliken charges with hydrogens summed into heavy atoms:
elementType: C C C C C N C C C B C C C C
charge: -0.168133 0.106435 0.181380 -0.057893 -0.226255 0.321055 0.362136 0.290574 0.060508 0.250277 -0.667957 -0.003783 0.660455 -0.108799
1716.lowfreq: -0.0006 -0.0005 -0.0004 16.9453 25.6358 33.6824 63.5473 68.9629 111.7043
frequency: 61.3092 68.4243 111.2424 138.1419 148.8500 192.3435 224.6990 252.1953 290.2467 302.1856 336.8562 347.1006 399.7489 416.1725 454.9524 526.5244 565.9585 607.1606 628.7809 651.8720 710.0434 745.9800 765.4019 772.5452 790.5737 792.8525 798.3884 912.1244 920.1789 942.7972 999.0290 1006.2603 1019.4946 1029.1916 1031.1664 1042.0071 1049.5714 1077.5157 1084.7313 1121.1616 1137.5380 1140.1640 1171.1221 1190.7122 1205.0508 1234.4788 1282.5987 1293.6340 1312.5377 1332.9301 1345.3485 1386.1422 1449.4069 1462.5820 1473.8760 1487.3100 1500.1932 1504.7968 1508.6651 1518.0638 1529.8655 1549.5068 1616.5046 1638.4292 1648.8604 1688.5898 3092.9117 3096.7939 3175.8435 3195.6894 3198.1834 3199.6975 3203.0454 3207.6983 3208.2825 3208.8464 3213.8033 3222.5256 3225.7094 3232.2536 3417.7525
redmass: 3.1567 3.8192 3.6259 3.4815 2.4288 4.1765 2.6870 1.3032 1.1719 3.7344 3.5065 3.2983 3.3172 2.4748 3.5608 3.5710 3.2115 3.3523 2.4544 6.5660 3.9164 2.0776 3.1346 1.6505 2.5526 2.3065 1.8786 1.4936 2.3316 3.1979 4.2617 1.4181 1.3244 1.5679 2.0005 1.3501 2.7572 1.2045 2.1380 1.4663 1.6851 1.1724 1.6017 1.9287 1.1520 1.5500 2.0693 2.4120 2.0827 1.6806 2.5249 1.7237 1.1692 1.2197 1.3163 1.1156 1.5066 1.1191 1.2244 1.0748 1.2332 1.6606 7.4308 5.2667 5.4960 5.3734 1.0315 1.0307 1.0870 1.1075 1.0917 1.1074 1.1076 1.1029 1.0937 1.0977 1.0911 1.0945 1.1039 1.0994 1.0768
irintensity: 0.1662 1.7176 0.3553 3.7106 4.0340 6.6644 0.5639 0.0909 0.8141 2.0071 0.8481 1.2355 0.3352 1.1878 1.8418 7.2299 20.1960 2.1284 0.2800 10.7927 34.3652 100.9847 5.2307 4.7475 53.1987 10.4394 25.1377 4.1721 27.5546 16.9475 15.4300 0.9924 0.1392 5.0496 20.5280 0.3253 37.5520 2.2152 3.8426 5.1837 5.1664 13.3067 20.4995 4.4181 0.4253 5.1679 96.1246 123.3080 57.0886 2.7160 34.1196 216.5075 1.3713 16.3493 21.3786 5.1870 4.3953 15.7161 20.5182 21.3104 34.3780 45.9995 104.1278 3.1594 8.6730 125.8410 3.7856 2.4807 9.4531 2.1469 7.7852 3.0038 3.4869 1.0830 2.1918 14.3371 1.0857 4.6834 5.5507 3.4068 363.8422
temp: 298.150 k
press: 1.00000 atm
elementType: 6 6 6 6 6 1 1 1 1 7 6 1 1 1 6 1 1 1 6 5 6 6 6 1 6 1 1 1 1
symmnumber: 1
zpe: 658207.6 jmol-1
zpe.correction: 0.250698 hartree
zpe.thermalcorrener: 0.263324 hartree
zpe.thermalcorrenthalpy: 0.264269 hartree
zpe.thermalcorrgfe: 0.211975 hartree
zpe.sumelectzpe: -545.379672 hartree
zpe.sumelectthermal: -545.367046 hartree
zpe.sumelectthermalent: -545.366102 hartree
zpe.sumelectthermalfe: -545.418395 hartree
dipole: 5.9410 19.4781 -1.5157
dipole: 20.4203
quadrupole: -47.0992 15.6090 -73.8874
quadrupole: 24.1604 -0.4201 -15.6216
quadrupole: -11.9734 50.7348 -38.7615 24.1604 -0.4201 -15.6216
hfenergy: -545.6303703 hartree
pointgroup: C01 [X(C12H15B1N1)]
dipole: -0.8481269 2.0757976 -0.9392051 debye
polarizability: 231.8320673|2.8784367|160.6236823|6.7559305|-32.7713176|129.3998414 unknown
InChI: InChI=1/C12H15BN/c1-14(2)12-8-4-3-7-11(12)13-9-5-6-10-13/h3-10,14H,1-2H3
charge 1 multiplicity 1
29 atoms
C  -0.67016504 1.05614509 0.90306058
C  0.71082466 1.16823391 0.98205479
C  0.59389866 3.30511839 -0.05884778
C  -0.78410098 3.23035456 -0.1294123
C  -1.41636677 2.08690696 0.3480147
H  -1.16584415 0.17116085 1.28258434
H  1.28433108 0.36307638 1.42593188
H  -1.37797599 4.03811328 -0.54026208
H  -2.49545585 2.01281568 0.29206097
N  1.26013796 4.53799338 -0.53773121
C  0.92782639 5.73233813 0.30021523
H  1.14058812 5.48898842 1.33906696
H  1.54359847 6.56662202 -0.03205803
H  -0.12643933 5.96942265 0.1766307
C  1.04821686 4.78894407 -1.99622342
H  1.31722693 3.88645114 -2.54129793
H  0.00279003 5.03430926 -2.16881893
H  1.68061626 5.6225672 -2.2972419
C  1.39202355 2.29062534 0.48345512
B  2.94833422 2.28465301 0.51280961
C  3.98511674 3.06298062 -0.40187413
C  3.8472387 1.49458392 1.54377599
C  5.19670592 2.75623806 0.08840388
H  3.88440639 3.63484397 -1.32020968
C  5.11243479 1.84407221 1.28397532
H  3.56442831 0.85813138 2.37295407
H  6.14774199 3.07767391 -0.32397463
H  5.99549084 1.53592703 1.83295537
H  2.26401296 4.37078882 -0.41401683
