program: Gaussian 16
title: cl_benzopiperidine_prot
version: AS64L-G16RevC.02
method: RwB97XD
basis: GenECP
operation: Freq
keyword: #N
keyword: Geom=AllCheck
keyword: Guess=TCheck
keyword: SCRF=Check
keyword: GenChk
keyword: RwB97XD/GenECP
keyword: Freq
converged: YES YES NO YES
title: Mulliken charges:
elementType: H C C C C H C H H B H C N C C C H H C H H C H H H H H H Cl Cl
charge: 0.266526 -0.518190 -0.150820 -0.404683 0.221908 0.244822 -0.083833 0.284692 0.228731 -0.173631 -0.322221 0.303820 0.268162 -0.346960 -0.240384 -0.293277 0.278918 0.250126 -0.440310 0.295456 0.235529 -0.590025 0.265945 0.203655 0.250753 0.214694 0.252438 0.175836 0.228112 0.094213
chargesum: 1.00000
title: Mulliken charges with hydrogens summed into heavy atoms:
elementType: C C C C C B C N C C C C C Cl Cl
charge: -0.251665 0.094002 -0.119991 0.221908 0.144898 -0.173631 0.303820 -0.054059 0.182084 0.290601 0.176323 0.025138 -0.161752 0.228112 0.094213
1716.lowfreq: -21.4503 -11.5674 -0.0017 -0.0016 0.0012 16.6395 41.7652 75.4975 98.3437
frequency: 41.0635 74.4723 98.2595 124.8895 140.7442 174.9163 212.4013 236.7951 248.0554 282.5987 313.5535 357.9306 380.8858 402.5530 422.8128 460.3628 503.1687 531.6069 550.4670 570.7006 644.5200 658.7206 765.9805 792.9513 799.5647 819.7516 851.7323 888.4338 898.3763 914.4831 921.8766 935.4825 945.1991 978.1237 1019.3389 1037.0757 1045.0019 1051.9881 1057.4042 1098.3424 1108.4529 1130.8104 1163.6767 1182.6028 1210.0692 1227.3872 1243.8970 1247.9881 1298.7354 1309.7567 1311.1692 1340.5545 1358.9766 1366.9434 1399.2568 1408.3084 1413.2056 1424.8584 1456.9560 1469.1627 1492.8558 1499.1680 1499.9099 1505.2371 1515.0526 1531.0550 1547.4446 1643.0621 1685.1086 3052.6065 3059.2218 3065.2552 3088.0365 3110.5859 3124.3438 3126.6063 3130.2400 3154.9428 3174.3320 3213.3552 3224.2981 3233.8999 3238.2053 3379.9570
redmass: 13.0701 3.7378 3.4216 4.1290 5.2935 4.3640 5.5922 7.7124 2.0757 5.6394 3.6750 3.1867 8.0038 2.2265 3.8075 2.9825 3.9824 1.8487 3.4870 5.3801 6.3685 4.3597 4.0870 1.3412 2.3186 1.4507 3.7292 2.5617 2.1908 1.5702 3.6890 1.7167 7.9132 1.4673 1.3807 2.4869 1.3515 2.6887 1.9110 2.3292 1.9277 2.5167 1.0762 2.2283 1.1546 2.2733 1.4853 3.0761 1.3752 1.6742 1.5725 1.7884 1.3861 1.2936 1.4578 1.3671 1.3269 1.3747 1.1442 1.4369 1.1756 1.3573 1.2855 1.1418 1.0993 1.2170 1.7576 5.1374 5.3879 1.0699 1.0674 1.0643 1.0619 1.0610 1.0962 1.0977 1.0988 1.1100 1.1094 1.0883 1.0921 1.0937 1.0980 1.0771
irintensity: 0.1603 0.3515 0.3278 0.7588 0.1742 7.6043 1.1530 2.9945 0.8051 1.6237 2.4955 3.8249 1.3023 0.6834 1.4675 0.7477 10.0139 1.1801 25.4705 10.5504 11.4443 15.5336 3.9642 47.9765 8.9220 5.9006 10.4302 28.1763 73.5543 5.6072 172.3056 5.0255 336.6026 7.9629 0.7538 14.6888 0.3913 20.7423 6.0643 3.8630 2.2423 23.8695 2.1262 9.5151 5.4744 69.3960 7.1040 251.6395 28.0173 7.0388 7.5083 27.7471 16.2126 1.1415 1.1236 0.4886 0.8090 13.6422 16.8112 42.6231 25.4225 0.2300 13.5937 6.9756 26.7405 13.8806 47.6213 16.1432 110.0713 8.6176 8.1544 30.0668 5.0032 6.4677 11.5708 16.3085 15.3803 4.2725 7.7339 0.2281 2.3377 3.6069 2.1237 393.6202
temp: 298.150 k
press: 1.00000 atm
elementType: 1 6 6 6 6 1 6 1 1 5 1 6 7 6 6 6 1 1 6 1 1 6 1 1 1 1 1 1 17 17
symmnumber: 1
zpe: 667636.7 jmol-1
zpe.correction: 0.254289 hartree
zpe.thermalcorrener: 0.267608 hartree
zpe.thermalcorrenthalpy: 0.268552 hartree
zpe.thermalcorrgfe: 0.213677 hartree
zpe.sumelectzpe: -1427.853361 hartree
zpe.sumelectthermal: -1427.840043 hartree
zpe.sumelectthermalent: -1427.839098 hartree
zpe.sumelectthermalfe: -1427.893974 hartree
dipole: -4.8276 3.5892 -0.3999
dipole: 6.0289
quadrupole: -70.1504 -84.2828 -95.8301
quadrupole: 5.7212 -0.6126 -2.2154
quadrupole: 13.2707 -0.8617 -12.4090 5.7212 -0.6126 -2.2154
hfenergy: -1428.1076504 hartree
pointgroup: C01 [X(C11H15B1Cl2N1)]
dipole: -1.9561817 1.4288638 -0.37974 debye
polarizability: 215.9005537|6.5214952|206.7198581|10.4370641|-15.3060725|133.1841342 unknown
InChI: InChI=1/C11H15BCl2N/c13-12(14)10-6-2-3-7-11(10)15-8-4-1-5-9-15/h2-3,6-7,15H,1,4-5,8-9H2
charge 1 multiplicity 1
30 atoms
H  3.23212045 3.27801402 -0.39846288
C  2.3551696 2.64751104 -0.32324199
C  2.49527291 1.30479713 -0.00967735
C  1.09144598 3.17605533 -0.5315816
C  1.39450676 0.43466701 0.09129972
H  3.49030335 0.91270558 0.1555254
C  -0.02470664 2.35553332 -0.429678
H  0.96325942 4.22470274 -0.76955234
H  -1.0077896 2.78099 -0.58293504
B  1.71626071 -1.0621533 0.40288254
H  -0.80662329 -0.76519682 0.11275119
C  0.13077839 1.01343295 -0.13378415
N  -1.10038956 0.21034918 -0.01064485
C  -1.90401384 0.56559293 1.21895355
C  -1.94789297 0.20415148 -1.26185509
C  -3.06082187 -0.40639137 1.38231509
H  -1.21151459 0.53727784 2.06038991
H  -2.25325261 1.59105483 1.08495378
C  -3.10793583 -0.76536932 -1.10003818
H  -1.28495568 -0.07195935 -2.08181243
H  -2.30085556 1.22349591 -1.41951649
C  -3.94373541 -0.43803102 0.13619976
H  -3.63037039 -0.10208634 2.26247766
H  -2.66761114 -1.40762544 1.59130012
H  -3.71179386 -0.71382004 -2.00783096
H  -2.72333092 -1.78952403 -1.03683094
H  -4.73516025 -1.1787461 0.25858287
H  -4.43192992 0.53430911 0.00562824
Cl 0.58148479 -2.39097414 0.06876085
Cl 3.25106256 -1.54397514 1.08063563
