program: Gaussian 16
title: cl_biphenylene_prot
version: AS64L-G16RevC.02
method: RwB97XD
basis: GenECP
operation: Freq
keyword: #N
keyword: Geom=AllCheck
keyword: Guess=TCheck
keyword: SCRF=Check
keyword: GenChk
keyword: RwB97XD/GenECP
keyword: Freq
converged: YES YES YES YES
title: Mulliken charges:
elementType: C C C C C C C H C H H C H C H C C H B N C H H H C H H H H Cl Cl
charge: 0.480526 0.674565 -0.252035 -0.399784 -0.254483 0.092475 -0.211944 0.233955 -0.530655 0.277925 0.205117 -0.364160 0.243627 -0.387391 0.274791 -0.497277 0.219088 0.212267 -0.158313 0.239934 -0.389567 0.224358 0.238676 0.262963 -0.398945 0.231428 0.248671 0.252603 -0.041704 0.182952 0.090337
chargesum: 1.00000
title: Mulliken charges with hydrogens summed into heavy atoms:
elementType: C C C C C C C C C C C C B N C C Cl Cl
charge: 0.480526 0.674565 -0.252035 -0.399784 -0.020528 0.092475 0.065981 -0.325538 -0.120532 -0.112599 -0.285009 0.219088 -0.158313 0.198229 0.336430 0.333756 0.182952 0.090337
1716.lowfreq: -14.9176 -0.0016 0.0017 0.0022 6.6936 17.7579 38.4310 64.4394 105.7895
frequency: 34.1324 60.3357 105.0373 113.2255 139.6467 152.4598 156.5087 174.7107 224.4200 229.6843 266.3443 280.8104 311.0737 322.3346 345.4743 356.0877 386.5683 414.3361 442.6577 464.9317 494.4238 548.3805 567.8545 594.8958 614.1445 650.0121 655.8850 722.1354 737.2374 739.5193 782.1971 803.3919 832.7142 848.8122 906.4537 937.1427 938.1019 962.5568 989.7872 1007.2845 1012.4333 1018.7273 1030.8798 1061.5633 1084.2766 1087.5948 1138.4057 1158.2764 1178.2924 1193.5755 1203.9659 1212.4847 1242.7839 1251.6122 1276.7167 1298.0401 1316.5919 1406.4857 1427.3580 1455.5133 1468.4997 1483.8503 1490.5286 1501.2183 1506.5443 1507.7620 1512.0297 1534.7626 1538.4440 1540.4263 1640.2527 1671.6854 1693.0638 1740.3332 3088.2248 3102.0612 3189.5383 3201.1315 3204.5810 3209.2486 3212.1814 3212.3600 3221.4736 3224.7947 3230.3391 3232.5421 3350.8031
redmass: 13.6899 5.7569 3.7834 5.1227 3.1815 8.2853 4.2166 3.7950 2.5759 2.4220 3.5147 2.2237 2.9190 2.9267 1.6217 4.5810 12.1605 6.0123 5.9744 4.1194 3.1217 3.5738 5.5292 5.5761 6.1428 4.6729 4.3887 5.9028 4.4769 3.8614 1.6197 1.5354 3.5970 5.7335 7.7417 2.2930 1.8962 1.3909 5.3894 6.5134 1.3583 1.3501 2.2330 2.9819 1.2662 1.6766 2.0133 2.3405 1.5843 1.8779 1.5413 1.7682 3.8955 2.0884 1.6905 1.9993 2.7314 2.1602 2.0112 1.1993 1.2031 1.2049 1.2081 1.1095 1.8727 1.3857 2.0223 3.8210 1.0892 1.1192 8.6457 6.6611 7.7742 8.2756 1.0314 1.0311 1.1079 1.1087 1.1084 1.0878 1.0971 1.0983 1.0929 1.0932 1.0977 1.0978 1.0785
irintensity: 0.2781 2.9806 0.3263 3.1970 2.7009 1.5429 8.4713 0.4969 1.1731 2.0444 2.9908 0.9695 0.6816 2.6505 1.8862 3.4487 2.8249 1.4727 2.9716 0.3403 6.7498 0.6635 19.3919 3.6611 5.3872 2.7709 7.1207 48.9917 18.7680 26.3836 0.7686 80.9904 1.6729 26.0512 383.9740 65.2747 31.1341 2.2850 149.5065 12.1088 1.5222 0.4448 21.2779 15.1767 9.2902 27.1276 4.0376 91.2690 29.6628 4.7412 7.8143 16.8820 236.5901 2.3891 4.1843 38.8015 123.4925 6.8201 79.6848 3.5851 8.8056 4.4316 16.1558 21.2398 8.5662 22.7585 0.6553 5.3633 41.1070 35.8454 104.6495 39.6506 13.0473 4.9611 3.0780 2.3110 1.6485 4.8445 1.0213 0.4249 0.0541 3.2284 1.8288 1.4668 6.3376 1.6957 564.5264
temp: 298.150 k
press: 1.00000 atm
elementType: 6 6 6 6 6 6 6 1 6 1 1 6 1 6 1 6 6 1 5 7 6 1 1 1 6 1 1 1 1 17 17
symmnumber: 1
zpe: 645253.5 jmol-1
zpe.correction: 0.245764 hartree
zpe.thermalcorrener: 0.261325 hartree
zpe.thermalcorrenthalpy: 0.262269 hartree
zpe.thermalcorrgfe: 0.202581 hartree
zpe.sumelectzpe: -1540.875132 hartree
zpe.sumelectthermal: -1540.859572 hartree
zpe.sumelectthermalent: -1540.858628 hartree
zpe.sumelectthermalfe: -1540.918316 hartree
dipole: -6.7835 -4.6119 -0.3886
dipole: 8.2120
quadrupole: -85.4373 -70.5417 -114.9875
quadrupole: 15.2576 -0.8274 0.5504
quadrupole: 4.8849 19.7805 -24.6653 15.2576 -0.8274 0.5504
hfenergy: -1541.1208966 hartree
pointgroup: C01 [X(C14H13B1Cl2N1)]
dipole: -2.754178 -1.8588956 -0.0935407 debye
polarizability: 322.1074898|21.4291434|271.2313053|-14.7205918|-4.0127109|129.236988 unknown
InChI: InChI=1/C14H13BCl2N/c1-18(2)12-8-4-6-10-9-5-3-7-11(15(16)17)13(9)14(10)12/h3-8,18H,1-2H3
charge 1 multiplicity 1
31 atoms
C  0.21070998 1.06390196 -0.00396614
C  -0.43114559 2.32167128 0.01857341
C  -1.77430799 1.66570142 0.08872559
C  -1.15728982 0.39057477 0.05580926
C  -3.12398631 1.85152643 0.13858898
C  -1.93590325 -0.73131209 0.05683904
C  -3.9089355 0.67650826 0.14777909
H  -3.58485613 2.83035924 0.16384543
C  -3.33808361 -0.57797422 0.10336311
H  -4.98828086 0.75732665 0.18660311
H  -3.98260989 -1.4483917 0.10440058
C  0.24053226 3.50962923 -0.04275276
H  -0.25578562 4.471621 -0.02379951
C  1.64316277 3.40986584 -0.13963999
H  2.23916528 4.31290055 -0.19225795
C  2.27849889 2.18547993 -0.17331669
C  1.58772733 0.93677791 -0.09617139
H  3.35862095 2.17296778 -0.25078312
B  2.42305648 -0.36178142 -0.08530956
N  -1.3500615 -2.0769692 -0.02229135
C  -1.83990249 -3.00871469 1.04034154
H  -2.87706387 -3.26970673 0.84392692
H  -1.22148929 -3.9046803 1.01616112
H  -1.74915469 -2.50978912 2.0029376
C  -1.46715986 -2.66549515 -1.39379397
H  -0.93908921 -3.61794521 -1.40590524
H  -2.52036741 -2.81096743 -1.6259764
H  -1.0174077 -1.97326722 -2.10295262
H  -0.34524082 -1.9533012 0.15625348
Cl 1.77930007 -1.91454712 0.51544729
Cl 4.08968037 -0.40984845 -0.60853885
