program: Gaussian 16
title: Me_Cl-H+
version: ES64L-G16RevC.01
method: RwB97XD
basis: GenECP
operation: Freq
keyword: #N
keyword: Geom=AllCheck
keyword: Guess=TCheck
keyword: SCRF=Check
keyword: GenChk
keyword: RwB97XD/GenECP
keyword: Freq
converged: YES YES YES YES
title: Mulliken charges:
elementType: C C C C C C H H H H N B C H H H C H H H H Cl Cl
charge: -0.386731 -0.245944 0.207047 0.317917 -0.228260 -0.430571 0.270599 0.229418 0.218291 0.277267 0.026734 -0.247553 -0.406137 0.223531 0.235086 0.245110 -0.369738 0.231710 0.226111 0.243899 0.119442 0.150844 0.091927
chargesum: 1.00000
title: Mulliken charges with hydrogens summed into heavy atoms:
elementType: C C C C C C N B C C Cl Cl
charge: -0.116132 -0.016526 0.207047 0.317917 -0.009969 -0.153303 0.146176 -0.247553 0.297590 0.331983 0.150844 0.091927
1716.lowfreq: -51.2507 -4.9400 -0.0012 0.0009 0.0019 26.4671 47.5377 71.7788 125.4269
frequency: 41.5857 65.2896 125.2496 157.5919 162.8373 204.6537 221.5219 252.1384 280.0527 325.6207 347.0124 384.6488 395.7978 430.8021 517.5364 559.2861 569.2749 609.5326 646.5339 766.3469 775.5496 801.9321 900.3350 911.6629 937.8527 951.5011 1011.2169 1027.3627 1052.2731 1077.6796 1088.0893 1126.0664 1166.9935 1192.3804 1205.9618 1230.1292 1252.8687 1289.6049 1306.2613 1340.1689 1446.0359 1464.5213 1465.8548 1494.6527 1498.7038 1501.5844 1507.4424 1520.7316 1529.1525 1552.9852 1642.2715 1686.3799 3086.3297 3099.6818 3185.6305 3198.4593 3202.7162 3213.1747 3215.9341 3219.4794 3230.2528 3237.0690 3378.0404
redmass: 8.8553 3.9322 2.8280 3.4747 3.7683 1.6138 2.8021 9.1095 2.4554 1.4703 3.2389 5.9698 4.6736 4.1365 3.6123 3.7008 4.6112 3.5250 7.1436 3.4649 4.3078 1.3391 6.0146 1.4503 4.9874 5.6671 1.4411 2.1099 1.3449 1.1488 2.4465 2.7567 1.5734 1.8448 1.1310 2.2488 2.1497 1.7680 2.0809 2.7913 1.1519 1.1896 1.3652 1.0610 1.0651 1.8415 1.2194 1.0538 1.2733 1.5186 5.0259 5.3629 1.0318 1.0322 1.1080 1.1072 1.1079 1.0934 1.1056 1.0925 1.0940 1.0989 1.0782
irintensity: 1.0456 0.6632 0.1179 9.5403 3.4841 0.2664 3.6646 2.9151 3.2209 0.0210 1.2908 0.9837 1.1631 0.0861 5.2801 40.0572 2.6282 4.7815 23.1225 7.3373 13.5401 51.2053 131.4692 6.5144 293.3745 167.6460 2.2048 19.4362 0.3921 4.0717 2.0018 14.7770 27.5810 4.0635 2.3948 170.3016 180.1540 12.7096 11.1516 28.7291 1.7869 5.6752 26.4296 2.6050 27.3494 12.7035 17.2581 27.7321 20.7904 51.6756 12.3153 103.1733 2.0008 3.4311 2.7773 1.1658 1.9753 1.0619 1.8577 1.4354 0.2951 2.1093 467.7462
temp: 298.150 k
press: 1.00000 atm
elementType: 6 6 6 6 6 6 1 1 1 1 7 5 6 1 1 1 6 1 1 1 1 17 17
symmnumber: 1
zpe: 492181.3 jmol-1
zpe.correction: 0.187462 hartree
zpe.thermalcorrener: 0.199227 hartree
zpe.thermalcorrenthalpy: 0.200172 hartree
zpe.thermalcorrgfe: 0.148758 hartree
zpe.sumelectzpe: -1311.174423 hartree
zpe.sumelectthermal: -1311.162658 hartree
zpe.sumelectthermalent: -1311.161714 hartree
zpe.sumelectthermalfe: -1311.213128 hartree
dipole: 4.1483 19.8176 -0.7857
dipole: 20.2624
quadrupole: -67.2759 18.5116 -77.1553
quadrupole: 22.6566 -3.3863 -9.1514
quadrupole: -25.3027 60.4848 -35.1821 22.6566 -3.3863 -9.1514
hfenergy: -1311.3618853 hartree
pointgroup: C01 [X(C8H11B1Cl2N1)]
dipole: -1.6465381 2.6254423 -0.571807 debye
dipolederiv: -0.0843033 0.2280672 -0.0813597 0.1515306 -0.023955 -0.0390166 -0.0357075 -0.0571059 -0.0781451 0.0797617 -0.1887095 0.0526781 0.1136161 0.0153391 -0.0510036 -0.1387764 -0.0038703 -0.0418773 -1.2400694 0.110887 0.1196038 0.1428252 -0.3431567 0.1095163 0.1003163 0.1034744 -0.1831133 0.564238 0.2900788 -0.1878771 -0.1500663 0.5588467 -0.1663481 0.0409884 -0.2201362 -0.0251885 -0.4401881 -0.1131181 0.080164 -0.1590278 -0.0729877 0.0182844 0.0984624 0.006368 -0.1173951 0.2012426 -0.0072528 -0.0342659 0.111688 0.0650374 -0.0639955 -0.0724104 -0.0448667 -0.051889 0.0551851 -0.0422704 0.0283414 -0.0527809 0.0333455 0.0477454 0.0336244 0.0442052 0.1372272 0.1084606 0.0464339 -0.0085071 0.0369125 0.0379457 0.0275686 -0.0036546 0.0317044 0.1182649 0.106056 0.0509811 -0.0099881 0.0336034 -0.0085544 0.0465709 -0.0158835 0.044775 0.1401502 -0.0062767 0.0070846 0.0169381 0.0203283 0.1013257 0.0128613 0.0137485 0.0152867 0.1414273 -0.3903349 0.151275 -0.0028377 0.0415811 -0.5458292 0.0583115 -0.0006608 0.0062774 -0.3091719 2.2057677 -0.2440594 -0.2379014 -0.2803311 1.5119845 -0.8251332 -0.1892726 -0.8208311 0.9895476 0.1353094 -0.1170517 0.1414885 -0.042806 0.0934314 -0.1386395 0.0493216 -0.2031677 0.4115766 0.0029136 0.0452009 0.0104948 0.0246809 0.1186757 0.0021008 0.0759832 -0.0182961 0.0548102 0.03728 -0.0796886 0.0028518 -0.0640765 0.027711 0.0507151 -0.025291 0.0329985 0.0640031 0.1030543 0.0235709 -0.0143064 0.0178749 0.0101828 -0.057178 -0.0205395 -0.0208492 0.0502716 0.1029489 -0.043688 -0.0126984 0.0242657 0.3261913 0.2026855 0.0405483 0.3157031 0.200699 0.067085 -0.0694665 0.0430627 -0.0481023 0.0051245 -0.0001574 0.0567375 0.0209763 0.0574078 -0.0194976 0.0303908 0.0008026 -0.0130945 0.0974204 -0.0294259 -0.0335389 -0.0267643 0.0901681 0.0979036 0.0289434 -0.0325924 0.043052 0.044501 0.0361968 -0.0218429 0.0116953 0.0206083 0.5365325 -0.2842667 -0.0373013 -0.2122556 0.3221973 0.0020365 -0.0813254 0.0339638 0.1081897 -0.7365725 -0.1662702 0.3306882 -0.2021406 -0.6141468 0.3664606 0.3520685 0.3455593 -0.4333857 -0.4864964 0.3429282 -0.1674784 0.4627227 -0.7606301 0.3898441 -0.2228956 0.4029001 -0.3441856 unknown
polarizability: 178.8533029|-5.8886794|160.4590061|-10.204982|-26.8209603|109.2589467 unknown
InChI: InChI=1/C8H11BCl2N/c1-12(2)8-6-4-3-5-7(8)9(10)11/h3-6,12H,1-2H3
charge 1 multiplicity 1
23 atoms
C  -0.70066824 1.17611677 0.98483891
C  0.67486745 1.07316426 0.84973129
C  1.46832346 2.13464177 0.3773953
C  0.77765007 3.31900643 0.06189972
C  -0.59086875 3.44528004 0.21183196
C  -1.33675552 2.36605551 0.66809197
H  -1.27100851 0.32865267 1.34366243
H  1.15259398 0.13774387 1.11086554
H  -1.09210583 4.3775389 -0.01812008
H  -2.40974398 2.46486472 0.7768342
N  1.50651812 4.52132461 -0.40464202
B  3.00064856 1.85609526 0.24078035
C  1.04854398 5.00259183 -1.74588241
H  0.03307766 5.38306032 -1.66772373
H  1.7192944 5.79673069 -2.06813764
H  1.08810436 4.16672346 -2.44087089
C  1.509731 5.6116971 0.62077
H  2.13917554 6.42268465 0.2589813
H  0.48968997 5.96153056 0.7640854
H  1.90323281 5.20681175 1.55100271
H  2.48347912 4.23854179 -0.5379917
Cl 4.07945668 2.8424634 -0.77160816
Cl 3.76061006 0.51965984 1.06457318
