program: Gaussian 16
title: cl_indole_prot
version: AS64L-G16RevC.02
method: RwB97XD
basis: GenECP
operation: Freq
keyword: #N
keyword: Geom=AllCheck
keyword: Guess=TCheck
keyword: SCRF=Check
keyword: GenChk
keyword: RwB97XD/GenECP
keyword: Freq
converged: YES YES YES YES
title: Mulliken charges:
elementType: C C C C C C C C H H H N H B C H H H C H H H H Cl Cl
charge: -0.174509 0.797257 -1.234118 -0.954402 0.322325 -0.249132 -0.077048 0.510137 0.226702 0.257298 0.252776 0.131283 0.287983 -0.102309 -0.398230 0.274111 0.155865 0.200705 -0.460320 0.204373 0.218568 0.192186 0.435807 0.070395 0.112299
chargesum: 1.00000
title: Mulliken charges with hydrogens summed into heavy atoms:
elementType: C C C C C C C C N B C C Cl Cl
charge: -0.174509 1.085240 -1.234118 -0.727701 0.322325 0.008167 0.175728 0.510137 0.567090 -0.102309 0.232450 0.154807 0.070395 0.112299
1716.lowfreq: -0.0029 -0.0028 -0.0023 18.0216 24.0858 40.3694 51.2024 71.4937 104.5532
frequency: 50.2959 69.0100 104.4327 115.6989 156.6566 178.9126 200.7469 234.4005 240.0505 284.7591 326.4589 346.7507 369.0563 378.6995 442.1818 488.8970 507.3906 533.3141 588.2440 618.1232 653.0336 747.4991 755.8833 772.3786 843.2048 857.0963 885.0786 912.3223 946.2819 964.9893 979.8784 1010.2764 1025.1405 1042.6636 1065.7362 1127.1368 1168.8783 1172.0388 1182.4164 1200.9466 1243.8946 1266.3337 1300.7281 1317.9260 1348.9678 1387.4388 1412.9186 1422.1248 1463.8371 1475.2463 1483.3462 1491.7926 1509.4723 1519.5646 1553.4470 1626.1605 1672.4263 1697.8737 3057.7911 3102.7663 3127.5759 3150.9522 3201.8225 3210.0772 3214.6601 3217.3992 3226.6668 3247.5519 3490.5238
redmass: 6.0838 7.3432 3.2754 1.3100 3.5944 3.1871 12.6902 4.3816 2.5319 1.2449 3.8122 4.1057 12.8518 3.1769 3.2497 5.0761 5.9688 3.6280 3.9200 4.1907 5.0313 4.5921 6.1824 4.6440 2.3959 1.6690 3.4830 1.3669 4.0824 1.4674 8.6526 1.3565 1.6394 3.2305 1.5892 2.3924 1.3831 1.4094 1.8037 1.4172 2.2754 2.3805 1.8491 3.9143 1.4794 3.5719 1.2220 1.2706 1.6301 1.2846 1.0420 1.0569 1.3765 1.0670 3.1254 7.5135 6.6866 7.2263 1.0374 1.0305 1.1001 1.1035 1.0909 1.1088 1.0942 1.1096 1.0958 1.0986 1.0730
irintensity: 0.2438 2.2868 1.7895 1.7821 0.2866 4.8277 3.7612 0.4528 0.8966 0.7842 1.0741 2.8567 1.2780 0.2617 9.8669 9.4564 6.3761 20.0681 1.2466 14.9635 28.3539 7.1940 23.7178 65.9056 33.2919 20.3495 87.2972 5.5609 20.9629 18.4520 399.6669 2.5800 16.1491 14.1160 8.4209 31.5735 62.3731 124.3118 250.5836 40.0406 105.4643 104.7124 24.0161 38.0759 12.8773 19.9582 24.2837 2.3838 16.0003 15.6170 12.4201 7.3455 5.7812 29.7704 2.6746 459.0430 213.2778 44.8652 7.8824 3.8782 5.5367 11.6209 2.3876 0.6603 0.2619 0.7406 0.6586 3.4066 112.6771
temp: 298.150 k
press: 1.00000 atm
elementType: 6 6 6 6 6 6 6 6 1 1 1 7 1 5 6 1 1 1 6 1 1 1 1 17 17
symmnumber: 1
zpe: 520305.3 jmol-1
zpe.correction: 0.198174 hartree
zpe.thermalcorrener: 0.211084 hartree
zpe.thermalcorrenthalpy: 0.212028 hartree
zpe.thermalcorrgfe: 0.158042 hartree
zpe.sumelectzpe: -1387.358131 hartree
zpe.sumelectthermal: -1387.345222 hartree
zpe.sumelectthermalent: -1387.344277 hartree
zpe.sumelectthermalfe: -1387.398263 hartree
dipole: 5.0216 2.4418 0.2636
dipole: 5.5901
quadrupole: -66.5855 -74.4744 -90.2258
quadrupole: -1.0331 1.4978 5.3848
quadrupole: 10.5097 2.6209 -13.1306 -1.0331 1.4978 5.3848
hfenergy: -1387.5563051 hartree
pointgroup: C01 [X(C10H11B1Cl2N1)]
dipole: 1.9199271 0.9585991 0.0770572 debye
dipolederiv: -1.9944172 0.3529493 0.0950616 1.0237262 -0.053325 -0.0222962 0.4919945 0.0843301 -0.231241 1.470357 0.0633392 0.0762983 -0.393052 0.1821752 0.1007959 -0.1463023 0.0602821 0.0805325 0.5358545 -0.0755512 0.1016077 0.188681 0.1088924 0.0515073 0.1374003 0.0726817 -0.0151288 -0.6748378 -0.0499539 -0.069455 0.1448102 0.0029586 0.0608391 0.0280908 0.0405092 -0.0754975 0.6959696 0.1842338 0.1225258 0.192877 0.0888214 0.0622319 0.1051646 0.0736449 -0.0109876 -0.1272449 -0.1598452 -0.0661462 -0.4910237 -0.133507 -0.0188318 -0.2198541 -0.0160096 -0.1328121 0.3633029 0.0404311 0.0273973 -0.1303402 0.1391637 0.1055963 -0.0179263 0.1017797 -0.0393567 -0.8358852 -0.0977012 -0.0723997 -0.4015632 -0.1714434 -0.0867653 -0.2168506 -0.0781044 -0.0299307 0.1017785 0.0193348 0.0107525 -0.0000811 0.0182679 -0.0653572 0.0090022 -0.055092 0.1292471 -0.0153844 0.0594182 0.0176175 0.0459916 0.088297 -0.0239042 0.011454 -0.0254927 0.1375698 0.0926129 -0.0194017 -0.0144933 -0.0057478 0.0294813 -0.0560553 -0.0058228 -0.05848 0.1307433 -0.4171272 -0.0423224 -0.0508097 0.2124019 -0.5160077 -0.0393145 0.0283165 -0.0137335 -0.068683 0.0979919 -0.0226276 -0.0170797 -0.0404476 0.1101674 -0.0097453 -0.0280884 -0.0186767 0.1344394 2.8692448 -0.0358758 -0.1051472 0.0567649 1.5097334 0.8255816 -0.1331616 0.8057933 0.8895637 0.0705316 -0.041233 0.0230698 -0.1403293 0.4617517 -0.1274208 0.1194851 -0.272815 0.1870849 0.0985629 0.0063301 0.0245258 0.0182717 0.0473065 -0.0720226 0.0169398 -0.0090095 0.0403478 0.0257287 0.0676712 0.0038902 0.0263429 0.08161 0.023298 0.0062774 0.0151696 0.0890293 0.0570687 -0.0871013 -0.0484034 -0.0152883 0.0411162 0.0105538 -0.0663531 -0.0136641 0.0612774 -0.2801412 -0.0804459 -0.0480391 0.0466698 0.0952327 0.016527 0.0596684 0.0186151 0.0823842 -0.0064433 0.0016048 -0.0506168 -0.0091884 -0.0064821 0.0668122 -0.1104153 0.0397319 0.0451554 -0.0150736 -0.0415272 0.0255497 -0.0921157 0.0823286 -0.01929 0.0338332 0.0054947 -0.034059 0.0316121 0.0657949 0.0314823 -0.0377956 -0.0635275 -0.0854657 -0.030716 -0.080676 0.0557487 0.2405092 -0.0049619 -0.0144304 -0.0270868 0.187519 0.0534345 -0.0757427 0.0613173 0.3000789 -0.7868817 -0.3452311 -0.2034752 -0.6118901 -0.620837 -0.3289162 -0.3126357 -0.3120176 -0.2967742 -0.597689 0.2426719 0.2007175 0.4394124 -0.7096933 -0.4217925 0.316242 -0.4255785 -0.4287319 unknown
polarizability: 273.6824177|-3.7905625|167.4831523|2.9879535|29.448797|114.9966299 unknown
InChI: InChI=1/C10H11BCl2N/c1-7-3-4-8-6-10(11(12)13)14(2)9(8)5-7/h3-6,14H,1-2H3
charge 1 multiplicity 1
25 atoms
C  -0.98740174 -0.24072842 -0.12767663
C  -0.22551492 -1.26500528 -0.55949201
C  1.27932361 0.29384275 0.18116221
C  2.46945982 0.89716629 0.51393049
C  3.64111829 0.17383575 0.26433093
C  3.55522929 -1.10416802 -0.31080252
C  2.34294505 -1.68934552 -0.63922644
C  1.17956684 -0.96929034 -0.38286851
H  2.51650803 1.88306029 0.96153445
H  4.47337828 -1.64971108 -0.49894505
H  2.30056973 -2.67865307 -1.0777536
N  -0.07404447 0.85650636 0.32228739
H  -0.62582163 -2.1881108 -0.95576169
B  -2.51548127 -0.17258557 0.0359455
C  -0.24067128 2.11564843 -0.48747887
H  -0.05160141 1.86140877 -1.5280397
H  -1.25269998 2.48731461 -0.35307264
H  0.4801316 2.8486569 -0.13311784
C  4.98475399 0.75331618 0.60467116
H  5.5411987 0.07487654 1.25535981
H  5.57804931 0.8968934 -0.30221303
H  4.89403769 1.71551056 1.10914575
H  -0.26737294 1.0771005 1.30416676
Cl -3.5131958 -1.3983617 -0.69959421
Cl -3.25343878 1.09702149 0.9992623
