program: Gaussian 16
title: MeQHBCl2-H+
version: ES64L-G16RevC.01
method: RwB97XD
basis: GenECP
operation: Freq
keyword: #N
keyword: Geom=AllCheck
keyword: Guess=TCheck
keyword: SCRF=Check
keyword: GenChk
keyword: RwB97XD/GenECP
keyword: Freq
converged: YES YES NO NO
title: Mulliken charges:
elementType: C H C N N N B H C H H H Cl Cl
charge: -0.441408 0.307366 0.008306 0.197242 0.149269 -0.203571 0.001607 0.454791 -0.382239 0.237600 0.251353 0.227392 0.070831 0.121460
chargesum: 1.00000
title: Mulliken charges with hydrogens summed into heavy atoms:
elementType: C C N N N B C Cl Cl
charge: -0.134042 0.008306 0.197242 0.149269 0.251220 0.001607 0.334106 0.070831 0.121460
1716.lowfreq: -14.8818 -0.0029 -0.0017 -0.0012 20.4264 40.3067 93.3233 108.0645 132.3036
frequency: 90.7113 105.9944 131.7741 140.3069 217.9666 286.2496 304.2535 405.2750 438.4161 509.7031 681.0848 700.0378 720.3207 810.8897 866.0712 876.9931 1011.4367 1086.2426 1091.5197 1104.9902 1165.0664 1211.2156 1277.5264 1374.2736 1412.0026 1451.2117 1476.8074 1493.3535 1513.3483 1515.6915 1641.2735 3101.9919 3201.4070 3218.8769 3292.4031 3605.0963
redmass: 5.9276 7.9432 1.0356 5.6505 14.3713 4.3073 5.3124 16.2559 3.6295 9.0021 2.9336 4.9625 10.9452 1.1299 1.5374 8.7070 11.4510 3.3690 3.7958 1.6640 1.3499 1.8937 2.0182 7.6888 4.3789 2.4399 1.4704 1.1148 2.2361 1.2456 3.8956 1.0315 1.1076 1.1084 1.1054 1.0857
irintensity: 0.3948 1.0656 0.0724 1.4891 8.2458 7.8987 1.0518 1.2075 11.1238 1.3711 26.2135 2.2746 0.3311 82.9058 25.0707 199.9680 447.8173 34.1288 4.7155 22.9028 1.3043 197.5765 116.1855 9.5335 31.0834 2.2609 18.0975 22.2963 9.8144 24.5175 30.8275 1.2292 0.1816 0.9878 28.6072 233.0322
temp: 298.150 k
press: 1.00000 atm
elementType: 6 1 6 7 7 7 5 1 6 1 1 1 17 17
symmnumber: 1
zpe: 260377.9 jmol-1
zpe.correction: 0.099173 hartree
zpe.thermalcorrener: 0.107734 hartree
zpe.thermalcorrenthalpy: 0.108678 hartree
zpe.thermalcorrgfe: 0.064243 hartree
zpe.sumelectzpe: -1226.592911 hartree
zpe.sumelectthermal: -1226.584350 hartree
zpe.sumelectthermalent: -1226.583406 hartree
zpe.sumelectthermalfe: -1226.627841 hartree
dipole: 12.0418 7.1234 1.5487
dipole: 14.0765
quadrupole: -27.4694 -37.0411 -55.5009
quadrupole: 9.3808 3.2861 4.9170
quadrupole: 12.5344 2.9627 -15.4971 9.3808 3.2861 4.9170
hfenergy: -1226.6920839 hartree
pointgroup: C01 [X(C3H5B1Cl2N3)]
dipole: -1.4042572 2.1837257 -1.1676601 debye
dipolederiv: 0.0618636 -0.0398334 -0.0561529 -0.0306066 0.1276969 0.1153114 0.0361996 -0.0476317 0.0604789 0.1791296 0.0157462 -0.0044748 0.0134808 0.1669189 0.007958 -0.0126351 0.0178346 0.1828846 -0.172046 0.313437 -0.0895028 0.2770571 -0.4507712 0.0661631 -0.2500751 0.3476788 -0.4076609 -0.0665096 0.0720043 0.037617 0.1008111 -0.2152628 -0.0424666 0.054859 -0.0622047 0.081826 -0.065915 -0.0090382 -0.2305158 -0.0124372 0.0441323 0.3093175 -0.2161463 0.2924679 -0.4017338 -0.1119436 0.1267634 0.1862574 0.1526179 -0.3625326 -0.2347242 0.2354129 -0.3377072 0.2909844 0.7826505 -0.7330543 0.1185824 -0.7314171 1.7104277 0.2103559 0.1486257 0.1631289 2.1129101 0.333182 -0.0231286 -0.0367792 -0.0243627 0.3809994 0.0675569 -0.044893 0.0876266 0.382723 0.2750359 -0.1811635 0.0315522 -0.2227049 0.4990239 -0.0594714 0.0237425 -0.0453638 0.0957846 0.1117657 0.033073 0.0329544 0.0381991 0.0782416 -0.0438489 -0.0007673 0.0158978 0.0386163 0.0365882 0.0272547 0.0273544 -0.0128212 0.007094 0.0502547 0.0449389 0.0338768 0.1035372 0.0360425 -0.0179308 -0.0677539 0.0346918 0.0442366 -0.0014274 -0.0557853 -0.036784 0.0873628 -0.1330435 0.0616829 -0.0823451 0.0553201 -0.2133666 -0.1192654 -0.1247554 -0.0502679 -1.159774 -0.2668002 0.3541873 0.1332066 0.3621717 -0.8168382 -0.3257134 0.1612791 -0.378552 -0.4679391 unknown
polarizability: 74.6346834|-28.3971875|106.1937345|7.4997715|-0.7796382|107.5428254 unknown
InChI: InChI=1/C3H5BCl2N3/c1-9-2-3(4(5)6)7-8-9/h2,7H,1H3
charge 1 multiplicity 1
14 atoms
C  2.56883797 1.60844592 1.15569173
H  2.43791442 2.06354527 2.12375214
C  3.19050068 0.4405118 0.78165997
N  2.0881618 2.15949356 0.01774346
N  2.36085045 1.43516772 -1.03454924
N  3.0157114 0.41719363 -0.56943703
B  3.91812903 -0.66612213 1.61119956
H  3.34053362 -0.28748516 -1.22386637
C  1.30981036 3.3922405 -0.12808679
H  1.24257873 3.61466709 -1.18934159
H  0.31811279 3.23122439 0.29057388
H  1.82488198 4.19353873 0.39659989
Cl 4.04178847 -0.48291228 3.32903337
Cl 4.56640118 -2.04858399 0.7793499
