program: Gaussian 16
title: cl_naphthalene_prot
version: AS64L-G16RevC.02
method: RwB97XD
basis: GenECP
operation: Freq
keyword: #N
keyword: Geom=AllCheck
keyword: Guess=TCheck
keyword: SCRF=Check
keyword: GenChk
keyword: RwB97XD/GenECP
keyword: Freq
converged: YES YES NO NO
title: Mulliken charges:
elementType: C C C C C C H C C H H C C H H H B N C H H H C H H H H Cl Cl
charge: -0.236794 -0.103858 -0.102947 0.457183 -0.293754 -0.453621 0.199692 0.423333 -0.172988 0.220099 0.274723 -0.574725 0.090004 0.242461 0.271237 0.247056 -0.743530 0.213438 -0.452109 0.255118 0.248333 0.236834 -0.362394 0.258606 0.215303 0.254256 0.045900 0.163856 0.179289
chargesum: 1.00000
title: Mulliken charges with hydrogens summed into heavy atoms:
elementType: C C C C C C C C C C B N C C Cl Cl
charge: -0.037103 -0.103858 -0.102947 0.457183 -0.073655 -0.178898 0.423333 0.069473 -0.303489 0.337059 -0.743530 0.259338 0.288176 0.365771 0.163856 0.179289
1716.lowfreq: -59.6628 -26.8150 -0.0034 -0.0031 -0.0028 11.2149 18.0537 27.4287 67.3266
frequency: -42.1236 14.1371 66.0966 107.0320 137.0450 150.4708 175.5272 191.0101 211.7832 225.1976 274.3350 315.2398 344.6132 350.6268 380.9534 428.9976 465.9447 480.7736 492.7394 524.9593 543.4727 549.8451 617.7224 625.7054 658.7651 724.3788 783.0002 793.0594 801.1528 838.6392 853.2507 912.6313 917.9907 952.1760 976.6649 1009.8160 1021.2370 1031.1327 1033.9434 1069.7879 1076.8937 1126.1770 1139.9907 1184.3059 1186.0907 1201.8398 1211.0737 1238.3889 1258.3258 1278.1900 1287.6365 1369.7236 1385.6196 1409.0758 1426.6845 1448.9821 1463.2476 1479.1994 1484.3382 1494.0713 1500.8935 1507.4340 1521.3236 1526.8946 1565.7589 1636.3404 1665.3638 1705.2837 3085.9350 3098.7869 3189.7095 3197.3029 3198.2464 3200.0171 3205.2031 3209.4065 3209.5703 3227.7614 3229.2444 3244.4204 3430.5460
redmass: 3.8672 5.8320 5.6860 4.4021 4.5633 4.0441 2.1360 2.4843 10.0824 2.2574 4.2390 2.8453 3.2552 1.3140 6.7169 3.5744 3.9626 4.0939 4.0710 4.6190 5.9227 5.8298 4.8912 4.2373 3.3441 5.1768 2.1644 1.3992 5.3567 5.0876 2.0139 5.4964 4.7621 1.3950 1.4337 3.8617 1.3594 2.0814 1.3567 1.9416 1.8588 1.9287 2.4831 1.7544 1.3386 1.5539 1.2996 1.9395 1.7104 1.8389 2.1644 3.6013 2.5180 2.8361 1.4881 1.1659 1.6249 1.1612 1.0776 1.1300 1.2736 2.3137 1.0992 1.0654 3.9684 6.2414 5.3384 6.1711 1.0309 1.0317 1.1090 1.0914 1.1086 1.1079 1.0901 1.1083 1.0924 1.0949 1.0978 1.0943 1.0755
irintensity: 1.5820 2.1781 1.2872 1.8145 11.3807 4.1816 1.3844 1.4584 1.3354 3.1135 0.7274 1.3678 2.2224 2.7438 4.3102 0.6163 2.4297 6.8900 6.3579 11.5729 9.1498 6.5082 0.6724 29.8266 2.3311 39.5377 38.3889 13.5641 4.4801 45.6507 78.8478 195.1495 193.0455 4.7286 8.1833 20.4228 1.1068 29.0892 1.3474 29.9899 30.6960 7.5093 142.8348 18.3558 7.1645 51.1416 40.4524 7.1901 12.4710 82.3207 87.2485 18.9038 2.3036 3.9666 10.7018 9.0066 1.6469 6.8800 5.8758 3.6699 40.6298 26.7225 20.1861 35.0315 63.9406 33.0600 16.0980 1.1902 2.7969 1.8941 0.9389 0.1218 1.6984 0.9743 0.0533 1.4003 1.3385 3.3027 5.8188 0.3069 450.6876
temp: 298.150 k
press: 1.00000 atm
elementType: 6 6 6 6 6 6 1 6 6 1 1 6 6 1 1 1 5 7 6 1 1 1 6 1 1 1 1 17 17
symmnumber: 1
zpe: 613428.0 jmol-1
zpe.correction: 0.233642 hartree
zpe.thermalcorrener: 0.247492 hartree
zpe.thermalcorrenthalpy: 0.248436 hartree
zpe.thermalcorrgfe: 0.191717 hartree
zpe.sumelectzpe: -1464.741911 hartree
zpe.sumelectthermal: -1464.728061 hartree
zpe.sumelectthermalent: -1464.727117 hartree
zpe.sumelectthermalfe: -1464.783836 hartree
dipole: 4.4417 -4.7928 -2.0078
dipole: 6.8360
quadrupole: -86.1347 -62.8655 -102.7455
quadrupole: -3.8594 3.1323 4.1058
quadrupole: -2.2194 21.0497 -18.8303 -3.8594 3.1323 4.1058
hfenergy: -1464.975553 hartree
pointgroup: C01 [X(C12H13B1Cl2N1)]
dipole: 1.7867317 -1.8437202 -0.6526651 debye
polarizability: 251.1760319|-2.9174671|236.5857035|24.820194|-9.5451405|135.6864875 unknown
InChI: InChI=1/C12H13BCl2N/c1-16(2)11-8-4-6-9-5-3-7-10(12(9)11)13(14)15/h3-8,16H,1-2H3
charge 1 multiplicity 1
29 atoms
C  2.57571233 -1.1012591 0.29825338
C  1.26421951 -0.82194744 0.02353931
C  0.74952914 0.51015564 0.00803779
C  1.71899025 1.53992882 0.18469999
C  3.06670585 1.22867969 0.4835022
C  3.48683785 -0.06678166 0.56455465
H  2.9402596 -2.11905823 0.30042379
C  -0.62178195 0.89717348 -0.2373711
C  1.34787119 2.90214666 0.03110973
H  3.76529174 2.04326284 0.63717366
H  4.516222 -0.30771869 0.79567195
C  0.078092 3.24794356 -0.31764535
C  -0.89653427 2.24117662 -0.44403521
H  2.10773341 3.66197883 0.17483577
H  -0.19686993 4.28404881 -0.46830477
H  -1.9130372 2.54688864 -0.66136342
B  -1.92539457 0.08802157 -0.01762799
N  0.39085821 -1.9427229 -0.39979214
C  0.24212195 -1.98503657 -1.89185841
H  1.21137773 -2.23555818 -2.31915817
H  -0.49787026 -2.74329989 -2.14307723
H  -0.0798577 -1.00700558 -2.24371755
C  0.75447525 -3.28836559 0.14031617
H  -0.06387714 -3.96530325 -0.09666582
H  1.66397335 -3.64490205 -0.33593623
H  0.88057211 -3.21171462 1.21825713
H  -0.53080466 -1.76526837 0.00746406
Cl -2.0810995 -1.05463601 1.34355043
Cl -3.34409731 0.28365198 -1.02307964
