program: Gaussian 16
title: cl_nmeimidazole_prot
version: AS64L-G16RevC.02
method: RwB97XD
basis: GenECP
operation: Freq
keyword: #N
keyword: Geom=AllCheck
keyword: Guess=TCheck
keyword: SCRF=Check
keyword: GenChk
keyword: RwB97XD/GenECP
keyword: Freq
converged: YES YES YES YES
title: Mulliken charges:
elementType: C C H C N N B H H H H C H Cl Cl
charge: -0.377889 -0.322201 0.266728 -0.134572 0.042881 -0.170948 -0.006990 0.423277 0.247354 0.191686 0.233480 0.142319 0.324815 0.046897 0.093163
chargesum: 1.00000
title: Mulliken charges with hydrogens summed into heavy atoms:
elementType: C C C N N B C Cl Cl
charge: 0.294630 -0.055473 -0.134572 0.042881 0.252330 -0.006990 0.467134 0.046897 0.093163
1716.lowfreq: -41.3398 -8.9759 -0.0023 -0.0022 0.0014 16.0697 57.3222 97.7927 122.9932
frequency: 55.4219 95.1176 122.2463 157.3080 220.0386 258.1038 292.7129 404.9263 428.8042 501.2610 632.0948 675.9150 682.4197 710.4754 858.7643 887.7057 907.9758 994.2094 1039.1661 1069.3441 1114.5032 1160.9367 1188.1863 1201.2454 1282.5356 1389.6894 1425.2674 1466.5800 1492.9583 1501.6002 1523.2775 1591.4488 1663.0119 3095.4093 3187.6717 3207.9116 3293.4550 3301.3586 3634.2750
redmass: 4.4366 6.1318 5.0873 1.1612 13.2612 3.4581 4.8609 13.0339 3.6157 8.4177 2.7737 4.3651 4.7479 1.1855 8.5101 1.4091 1.3789 10.7256 2.8836 4.5122 1.3920 1.3285 1.2199 1.7412 2.1576 6.2829 2.8985 1.2567 1.6313 1.4426 1.2041 4.4333 4.3758 1.0327 1.1083 1.1065 1.1032 1.1048 1.0844
irintensity: 1.1564 0.3704 1.1733 0.6839 8.9647 2.6852 0.6986 3.3738 3.0474 6.5347 49.2600 0.4899 2.0263 88.3053 170.8196 1.1495 29.8292 460.1949 3.8477 21.7890 2.7842 3.1211 19.2429 249.3630 143.9653 1.2912 17.9497 2.0239 33.2086 52.5359 50.6342 0.6859 100.6080 5.5123 0.3357 0.0825 26.7364 32.7868 211.4468
temp: 298.150 k
press: 1.00000 atm
elementType: 6 6 1 6 7 7 5 1 1 1 1 6 1 17 17
symmnumber: 1
zpe: 291382.4 jmol-1
zpe.correction: 0.110982 hartree
zpe.thermalcorrener: 0.119844 hartree
zpe.thermalcorrenthalpy: 0.120788 hartree
zpe.thermalcorrgfe: 0.075484 hartree
zpe.sumelectzpe: -1210.592219 hartree
zpe.sumelectthermal: -1210.583357 hartree
zpe.sumelectthermalent: -1210.582413 hartree
zpe.sumelectthermalfe: -1210.627716 hartree
dipole: 10.1442 1.1277 2.1033
dipole: 10.4211
quadrupole: -31.1959 -61.4941 -50.4212
quadrupole: 0.6263 1.1222 6.1096
quadrupole: 16.5078 -13.7904 -2.7174 0.6263 1.1222 6.1096
hfenergy: -1210.7032006 hartree
pointgroup: C01 [X(C4H6B1Cl2N2)]
dipole: 3.9363268 0.1663369 0.6631218 debye
dipolederiv: 0.5853247 -0.0956143 -0.200529 -0.1272498 0.1933073 0.0267681 -0.2310553 0.0207946 0.2284809 0.5191409 -0.0503933 -0.0983582 0.0005099 0.0151248 0.0280939 0.0504306 0.0231818 0.0523269 0.1334689 0.0042118 0.0022106 -0.0037251 0.1775942 -0.0095913 -0.0104323 -0.0103995 0.1574037 -1.1536348 0.105331 0.1639766 0.0356931 -0.0690318 -0.0347411 0.0025378 -0.026013 -0.1178856 -0.6260198 0.1035331 0.2019372 0.0179543 -0.1695945 -0.0764115 -0.0336727 -0.0617462 -0.2831334 -0.2129864 0.0992606 0.2379957 0.18249 -0.2271971 -0.0950141 0.4275198 -0.1005345 -0.385568 2.2171774 -0.0953494 -0.0916102 -0.0538656 0.624324 0.6636438 0.0079037 0.6633898 1.8902522 0.3234012 -0.0089663 -0.0239233 -0.0278392 0.3412737 0.0318991 -0.0685119 0.0296444 0.3936946 0.0226035 0.0548555 0.0111202 0.0243548 0.0556097 0.0631155 0.0552413 0.0416663 0.0345767 0.0274901 0.0108276 0.0157435 -0.0146391 0.111655 -0.0462025 -0.0591924 -0.0400817 -0.0033424 0.0280892 -0.0527617 0.0239877 0.0133687 0.0005258 -0.03818 0.0472681 -0.0173488 0.0992681 0.0603204 -0.1362173 -0.3284303 -0.1074584 0.2151703 0.1103388 -0.2569462 0.105282 0.3936263 0.1503287 0.0151868 0.0293543 0.0283642 0.1909687 -0.0044351 0.0558381 -0.0075736 0.1834121 -0.4759973 -0.1230691 -0.3111363 -0.1740867 -0.2222111 -0.3134983 -0.4341918 -0.3143259 -0.8582922 -0.5987068 0.1691651 0.3676615 0.2061289 -0.2375192 -0.3057854 0.4472633 -0.3059357 -0.78482 unknown
polarizability: 130.6937902|-3.3407626|67.8422389|-3.0261321|18.9236457|103.8658682 unknown
InChI: InChI=1/C4H6BCl2N2/c1-9-2-4(5(6)7)8-3-9/h2-3,8H,1H3
charge 1 multiplicity 1
15 atoms
C  3.68897517 -0.31151649 -0.74284157
C  1.16895069 -0.22600206 -0.69389967
H  1.06812022 -0.64839182 -1.6804501
C  0.21022334 0.18385146 0.18990467
N  2.39586523 -0.01826982 -0.11991533
N  0.91372156 0.63698329 1.29585972
B  -1.3331966 0.17794286 0.06520867
H  0.50040269 1.01126193 2.14041991
H  3.82364397 0.33709336 -1.60669969
H  4.47764398 -0.12743897 -0.01721017
H  3.70854755 -1.35623225 -1.04650684
C  2.21367903 0.50829652 1.09083086
H  2.99423961 0.78073722 1.78247666
Cl -2.07402503 -0.41945337 -1.39010276
Cl -2.30021941 0.77445912 1.39161164
