program: Gaussian 16
title: cl_quinoline_prot
version: AS64L-G16RevC.02
method: RwB97XD
basis: GenECP
operation: Freq
keyword: #N
keyword: Geom=AllCheck
keyword: Guess=TCheck
keyword: SCRF=Check
keyword: GenChk
keyword: RwB97XD/GenECP
keyword: Freq
converged: YES YES NO YES
title: Mulliken charges:
elementType: C C C C C C H C H H C C H H H N B H Cl Cl
charge: 0.147858 -0.110363 -1.810885 0.935273 0.123572 -0.654955 0.201343 0.733288 0.264397 0.284416 -0.775803 0.209087 0.293613 0.303361 0.320847 0.209969 0.016538 0.168742 0.058421 0.081283
chargesum: 1.00000
title: Mulliken charges with hydrogens summed into heavy atoms:
elementType: C C C C C C C C C N B Cl Cl
charge: 0.349201 -0.110363 -1.810885 0.935273 0.387969 -0.370540 1.026901 -0.472442 0.529934 0.378711 0.016538 0.058421 0.081283
1716.lowfreq: -5.5971 -0.0017 0.0013 0.0015 20.0097 27.4762 40.4358 109.8438 160.6169
frequency: 40.1761 109.6540 160.6000 176.5545 217.4778 236.7350 259.4979 373.7873 383.6111 434.7886 465.6713 482.0556 541.1373 546.7594 581.1610 636.4337 651.0905 786.8103 788.9334 800.2340 827.0468 857.5636 922.4963 925.4287 944.0540 995.8206 1024.5220 1046.5036 1047.8788 1087.5529 1106.5769 1119.3658 1170.0549 1213.4450 1253.4174 1273.4508 1279.1915 1348.0746 1396.9051 1407.7377 1454.6016 1504.5853 1528.4192 1632.4194 1652.1162 1665.8209 1715.7546 3208.6891 3212.9360 3221.5030 3237.1160 3243.1009 3255.7018 3496.8809
redmass: 13.0408 5.1331 9.2835 4.3528 4.2692 13.6476 12.3626 14.0481 4.2811 4.4883 4.2199 3.0944 7.5410 7.1029 4.6699 3.4692 7.5690 2.8962 6.1216 1.3151 5.5683 1.5845 4.7520 1.3455 9.3022 1.3563 1.3805 1.2963 1.3560 3.6604 2.2572 2.6540 1.2570 1.3953 2.2250 1.6022 1.8144 2.2870 2.5059 6.9908 1.8576 2.4710 2.4166 2.6601 4.9242 4.8565 4.4651 1.0929 1.0909 1.0918 1.0979 1.0943 1.0999 1.0809
irintensity: 0.1180 0.7391 6.3281 2.7031 1.3471 9.2154 1.2197 2.0165 0.2456 3.7830 19.8793 9.4889 7.1948 10.4965 0.1278 0.2373 19.9247 34.8844 55.6503 22.5466 0.9035 92.4115 137.6059 22.7772 304.8505 0.2331 1.4722 4.2138 0.5665 69.2990 128.0376 56.6555 25.5984 93.0063 13.3886 46.4424 126.9423 5.8559 12.0093 73.1842 1.6262 13.2109 14.5460 112.7536 26.0286 108.4501 208.5311 0.3536 0.0205 0.8617 1.4130 2.2354 7.9050 560.2152
temp: 298.150 k
press: 1.00000 atm
elementType: 6 6 6 6 6 6 1 6 1 1 6 6 1 1 1 7 5 1 17 17
symmnumber: 1
zpe: 388486.7 jmol-1
zpe.correction: 0.147967 hartree
zpe.thermalcorrener: 0.158215 hartree
zpe.thermalcorrenthalpy: 0.159160 hartree
zpe.thermalcorrgfe: 0.110816 hartree
zpe.sumelectzpe: -1346.913999 hartree
zpe.sumelectthermal: -1346.903751 hartree
zpe.sumelectthermalent: -1346.902807 hartree
zpe.sumelectthermalfe: -1346.951151 hartree
dipole: 8.0796 -1.3984 -0.3032
dipole: 8.2053
quadrupole: -54.8664 -57.2128 -88.1749
quadrupole: -6.1611 -1.0197 3.4945
quadrupole: 11.8850 9.5386 -21.4236 -6.1611 -1.0197 3.4945
hfenergy: -1347.0619662 hartree
pointgroup: C01 [X(C9H7B1Cl2N1)]
dipole: 3.2194326 -0.4987683 -0.0601434 debye
dipolederiv: 0.3503154 -0.0602298 -0.0094543 0.4997974 0.1751577 0.0184189 0.0650848 0.0302863 -0.0006316 -1.0681878 -0.1644075 -0.0129599 -0.5526503 -0.7554643 -0.0770732 -0.0573358 -0.0811278 -0.1406806 0.5874485 -0.3584556 -0.0383028 -0.1490254 0.0885371 -0.0090171 -0.0241083 -0.0115391 0.172404 -0.6406023 0.4318499 0.0507368 -0.1601207 -0.1474429 -0.0196216 -0.0198747 -0.025265 0.0203468 0.2167281 0.0275994 0.0024682 -0.1449053 0.2392788 0.0350478 -0.0157552 0.0382854 -0.067022 -0.6406431 0.1117982 0.0148002 0.0288284 0.18186 0.0308572 0.0041845 0.0273458 -0.1142502 0.0835949 0.0499605 0.0048468 0.0522222 0.1182507 -0.0010668 0.0058954 -0.0029069 0.1177122 0.4307331 -0.2893414 -0.0324543 -0.0436407 0.7285394 0.0811138 -0.0025296 0.0826543 0.0195758 0.0145396 -0.0530384 -0.0062535 -0.0020654 0.0911275 -0.007187 -0.0028815 -0.0081768 0.1487902 0.0883994 -0.003038 0.0004477 -0.0132742 0.0006647 -0.0172395 -0.0007373 -0.0174153 0.1611083 -0.0332564 -0.4667238 -0.0534257 -0.1389245 -0.8066154 -0.0718883 -0.0160425 -0.0708497 -0.1516324 0.5945652 0.6609703 0.0685451 -0.0126031 0.2701377 0.0166088 -0.0013677 0.014209 0.1180548 0.0840308 -0.015012 -0.0018308 -0.0531308 0.0838746 -0.0063081 -0.0055983 -0.0054613 0.1409792 0.0862997 0.0199091 0.0027035 0.0279332 0.0946098 -0.0092526 0.0048001 -0.010093 0.1735489 0.105397 -0.0186347 -0.002511 -0.0134461 0.1195632 -0.0028803 -0.0011339 -0.0027152 0.1578379 -0.8428154 -0.2852728 -0.0375426 0.0763925 -0.1270073 -0.005034 0.002719 0.00368 -0.1296361 2.425896 0.0321344 -0.0431678 0.1479977 1.9234345 0.2718279 -0.0296373 0.2660703 0.373223 0.7387857 0.1185254 0.0209097 0.1327277 0.2516345 0.0019294 0.0287237 -0.0006381 0.2409908 -0.4961815 -0.1073666 -0.0090491 -0.1662144 -1.0810223 -0.1614816 -0.0294686 -0.1595787 -0.1285598 -1.0850469 0.3687733 0.0814936 0.4841021 -0.449118 -0.0677535 0.0950633 -0.0667642 -0.1121595 unknown
polarizability: 213.6083539|-15.3226727|199.2641273|-2.6866597|14.6860408|80.6797907 unknown
InChI: InChI=1/C9H7BCl2N/c11-10(12)8-5-1-3-7-4-2-6-13-9(7)8/h1-6,13H
charge 1 multiplicity 1
20 atoms
C  -0.43037078 1.91931652 0.19698934
C  -0.46020074 0.54038236 0.04108341
C  0.81432397 -0.10212944 -0.03722354
C  2.021859 0.63327839 0.03686846
C  1.96594472 2.0407878 0.19281844
C  0.75837169 2.66951035 0.27128221
H  -1.36800983 2.45664548 0.26356767
C  3.25266043 -0.05065656 -0.04385463
H  2.8935986 2.59810774 0.24707798
H  0.7015222 3.743619 0.39160446
C  3.29680814 -1.41654695 -0.19578443
C  2.09494327 -2.1059761 -0.26500643
H  4.17225649 0.52141563 0.01469114
H  4.22996009 -1.95718339 -0.26092772
H  2.03281048 -3.17946386 -0.38556627
N  0.93848549 -1.45778017 -0.18546111
B  -1.86203891 -0.14868519 -0.03993267
H  0.07767649 -1.99931371 -0.24389007
Cl -2.08697867 -1.88445874 -0.32423551
Cl -3.33590012 0.77188883 0.14423527
