program: Gaussian 16
title: cl_xanthene_prot
version: AS64L-G16RevC.02
method: RwB97XD
basis: GenECP
operation: Freq
keyword: #N
keyword: Geom=AllCheck
keyword: Guess=TCheck
keyword: SCRF=Check
keyword: GenChk
keyword: RwB97XD/GenECP
keyword: Freq
converged: YES YES YES YES
title: Mulliken charges:
elementType: C C C C C C H H H C O C H H H C H H H C C C C C H C H H B N C H H H C H H H Cl Cl H
charge: 0.122985 -0.163160 -0.760053 -0.196075 0.437625 0.166554 0.188224 0.273861 0.196412 -0.109138 -0.102808 -0.495686 0.181362 0.184112 0.210200 -0.805644 0.202494 0.200869 0.211522 0.184624 -0.110027 0.043833 0.512310 -0.637848 0.201457 -0.846749 0.282153 0.216984 -0.069044 0.236788 -0.410954 0.249035 0.245372 0.254517 -0.351292 0.229762 0.240433 0.260362 0.116041 0.041322 0.167263
chargesum: 1.00000
title: Mulliken charges with hydrogens summed into heavy atoms:
elementType: C C C C C C C O C C C C C C C C B N C C Cl Cl
charge: 0.122985 0.025064 -0.486191 0.000337 0.437625 0.166554 -0.109138 -0.102808 0.079989 -0.190759 0.184624 -0.110027 0.245290 0.512310 -0.355696 -0.629765 -0.069044 0.404051 0.337970 0.379265 0.116041 0.041322
1716.lowfreq: -16.2929 -8.8370 0.0016 0.0018 0.0028 16.2913 33.7554 38.8022 55.1810
frequency: 28.8499 38.6706 53.8501 79.0509 94.0561 129.8254 146.6239 154.9511 158.1799 190.5072 215.8815 234.1920 245.7754 256.3691 262.2409 282.0957 291.3773 304.8689 306.1318 319.4816 339.9217 370.6781 383.0680 388.7866 418.2517 427.8103 452.3821 487.6990 525.3462 539.2677 551.2552 564.6530 589.0049 610.2658 625.2118 647.3353 681.9081 690.7818 767.6918 769.8684 781.3245 824.1001 828.0987 840.0198 858.0297 902.5418 906.0396 924.8391 950.2003 960.1423 973.3908 980.1159 1020.1408 1024.9379 1026.2935 1028.2226 1032.9911 1095.0566 1108.9335 1122.2364 1154.7482 1171.3033 1173.5069 1192.5694 1195.0578 1201.9482 1225.4374 1238.7472 1263.6511 1276.1570 1287.8437 1288.5606 1314.7950 1317.9285 1337.0562 1348.0633 1408.9582 1430.5589 1432.4649 1460.5426 1468.7638 1469.7771 1481.4477 1483.1815 1490.0499 1496.2999 1501.9283 1506.2962 1514.8942 1516.8836 1523.7859 1525.8867 1532.3243 1544.2306 1647.0164 1662.7527 1679.4057 1703.8966 3048.2300 3061.6255 3085.6867 3096.2854 3133.4382 3134.8098 3140.6767 3146.5004 3187.9718 3198.7313 3200.2616 3205.6617 3211.9705 3215.6984 3224.5922 3226.4113 3233.3415 3235.7664 3344.7925
redmass: 5.1888 7.0925 3.7703 5.0791 3.1329 10.5406 3.7795 3.2542 4.1242 3.1304 7.8852 3.4011 2.2416 1.6923 1.7786 1.3484 2.0195 2.3388 1.8327 2.2252 4.2689 2.4751 3.0922 3.3658 4.6061 4.7910 3.6150 5.7604 5.0522 4.3616 3.6087 3.6159 5.1934 4.8413 4.1294 4.8690 5.6159 5.8027 3.8387 2.1779 2.0610 2.1656 2.3162 4.6243 3.8542 6.4573 8.9422 2.7421 1.4411 1.6249 1.3796 3.0308 1.3815 1.4169 2.1017 2.3772 1.3302 1.1650 2.0483 2.3688 1.9442 2.4924 1.6728 1.9839 1.8306 1.3416 1.5157 2.8028 2.0953 2.7013 3.6552 1.9328 2.5767 2.8253 5.3937 5.1120 1.2261 1.3588 1.5133 1.1214 2.2539 1.1764 1.1430 1.0446 1.0559 1.1198 1.3182 1.1524 1.6726 1.1631 1.3920 1.1461 1.4755 2.3466 5.3436 7.6027 7.6305 7.4268 1.0342 1.0372 1.0317 1.0311 1.1037 1.1032 1.1020 1.1027 1.1089 1.1080 1.1083 1.1091 1.0879 1.0879 1.0918 1.0923 1.0975 1.0970 1.0772
irintensity: 1.2760 0.8688 0.1873 0.3713 5.9368 4.4400 0.0804 0.9040 8.3405 0.0907 2.6538 0.4076 0.7174 0.1334 1.2628 0.6812 1.1784 0.3600 0.4858 0.1081 0.3306 0.7213 1.4246 1.4126 3.0993 1.8383 3.8745 19.5915 5.3283 17.3088 0.7195 0.0901 4.9675 8.9879 8.1900 3.1698 14.4076 16.1306 39.1222 13.0822 70.8896 14.3207 13.2083 22.5668 9.7198 175.5526 267.4586 27.8723 2.6629 4.3600 1.7824 104.1904 1.5067 6.4417 26.5467 50.0562 2.4052 0.4761 29.0417 15.5833 17.5592 12.7500 20.1082 14.0238 17.7380 4.3318 44.9009 217.8562 69.2173 193.6684 104.0409 34.3545 3.6134 108.4190 55.6835 18.2453 11.4380 106.0448 222.5874 4.3523 203.1541 9.3677 3.4089 0.3750 1.7232 35.2873 0.4101 51.3401 12.6789 9.7815 58.4894 45.8161 44.6260 68.6925 34.3852 72.4838 73.0309 1.7241 19.9790 15.0651 4.2268 3.8861 21.6463 21.0991 23.0203 16.1231 2.1988 5.2604 1.3124 3.9213 0.5725 1.3164 1.2211 1.9623 9.2408 2.2936 500.7473
temp: 298.150 k
press: 1.00000 atm
elementType: 6 6 6 6 6 6 1 1 1 6 8 6 1 1 1 6 1 1 1 6 6 6 6 6 1 6 1 1 5 7 6 1 1 1 6 1 1 1 17 17 1
symmnumber: 1
zpe: 882921.8 jmol-1
zpe.correction: 0.336287 hartree
zpe.thermalcorrener: 0.356422 hartree
zpe.thermalcorrenthalpy: 0.357366 hartree
zpe.thermalcorrgfe: 0.287882 hartree
zpe.sumelectzpe: -1734.020254 hartree
zpe.sumelectthermal: -1734.000119 hartree
zpe.sumelectthermalent: -1733.999175 hartree
zpe.sumelectthermalfe: -1734.068659 hartree
dipole: -23.5419 14.9207 -5.7058
dipole: 28.4501
quadrupole: 20.1865 -77.9638 -126.9753
quadrupole: -60.9462 38.2340 -18.9718
quadrupole: 81.7707 -16.3796 -65.3911 -60.9462 38.2340 -18.9718
hfenergy: -1734.3565415 hartree
pointgroup: C01 [X(C17H19B1Cl2N1O1)]
dipole: -2.7260205 0.9743983 -2.0068678 debye
polarizability: 304.5653802|16.2201259|295.5037541|34.6329982|-59.0294308|217.6850023 unknown
InChI: InChI=1/C17H19BCl2NO/c1-17(2)11-7-5-9-13(18(19)20)15(11)22-16-12(17)8-6-10-14(16)21(3)4/h5-10,21H,1-4H3
charge 1 multiplicity 1
41 atoms
C  -2.07058335 1.3438764 0.9614335
C  -0.68863836 1.17434544 1.16461926
C  0.22175833 2.15627536 0.8231392
C  -0.224152 3.35302609 0.27949013
C  -1.57880928 3.59198221 0.06636927
C  -2.46599934 2.56974277 0.39687194
H  -0.32772775 0.25044641 1.59729981
H  1.28011276 1.99636413 0.98597082
H  0.5019891 4.11513088 0.02777196
C  -2.12191946 4.93960387 -0.41368031
O  -3.81054389 2.75388712 0.15805737
C  -1.08426733 5.73386154 -1.2107896
H  -1.49850987 6.69271478 -1.52659263
H  -0.21698621 5.96835711 -0.59232556
H  -0.74864133 5.18810382 -2.09578824
C  -2.53674324 5.75826675 0.83255962
H  -1.66410848 5.93726372 1.46557849
H  -2.95114591 6.72250936 0.52798403
H  -3.2873061 5.23247613 1.42772388
C  -3.37260927 4.66837004 -1.23855891
C  -4.16272195 3.59282369 -0.85770443
C  -3.82902239 5.44929439 -2.29678719
C  -5.36586146 3.31602299 -1.49091124
C  -5.03891458 5.18147928 -2.92882112
H  -3.24162403 6.2927265 -2.63541962
C  -5.82484104 4.11157395 -2.5248228
H  -5.37417704 5.81365803 -3.74092823
H  -6.76810368 3.90657095 -3.01708831
B  -3.01417185 0.19182532 1.3872448
N  -6.11297142 2.14825952 -1.00591017
C  -7.38302635 2.53276804 -0.31640584
H  -8.05326362 2.98881175 -1.04232073
H  -7.83367523 1.63596221 0.10501323
H  -7.14059997 3.24363034 0.47084872
C  -6.32611289 1.10881022 -2.05942945
H  -6.75741079 0.22684178 -1.58859466
H  -7.00380243 1.49876853 -2.81558923
H  -5.36273494 0.86976587 -2.50394635
Cl -4.79666985 0.27042274 1.42356072
Cl -2.37175656 -1.35474037 1.92489254
H  -5.50841691 1.71978537 -0.28906874
