program: Gaussian 16
title: MeQHBCN2-H+
version: ES64L-G16RevC.01
method: RwB97XD
basis: GenECP
operation: Freq
keyword: #N
keyword: Geom=AllCheck
keyword: Guess=TCheck
keyword: SCRF=Check
keyword: GenChk
keyword: RwB97XD/GenECP
keyword: Freq
converged: YES YES NO NO
title: Mulliken charges:
elementType: C H C N N N B H C H H H C N C N
charge: -0.174914 0.341480 -0.361478 0.234573 0.144572 -0.146891 0.929233 0.473174 -0.380992 0.241374 0.255819 0.230725 -0.238707 -0.116986 -0.305981 -0.125003
chargesum: 1.00000
title: Mulliken charges with hydrogens summed into heavy atoms:
elementType: C C N N N B C C N C N
charge: 0.166566 -0.361478 0.234573 0.144572 0.326284 0.929233 0.346927 -0.238707 -0.116986 -0.305981 -0.125003
1716.lowfreq: -20.4528 -16.0537 0.0004 0.0006 0.0006 32.5345 86.0328 94.4734 107.2195
frequency: 81.9832 91.9163 107.0993 109.5415 118.0311 211.6352 264.3023 303.9685 310.4484 400.3396 429.4502 475.4992 516.7611 598.7762 688.6502 703.9705 723.1500 830.7697 882.2233 930.7337 1087.3261 1102.8230 1109.3416 1135.2962 1159.8094 1234.8218 1302.4997 1379.0950 1408.1144 1449.5369 1477.1196 1495.4754 1510.8864 1531.7709 1643.6103 2362.2795 2367.3464 3102.0834 3204.1175 3218.7485 3283.7896 3592.6707
redmass: 4.3972 6.6372 3.9429 1.3770 6.8079 5.7600 5.4449 5.1979 10.5314 5.7938 7.1986 5.6565 12.4251 7.1912 3.3121 4.9693 10.7739 1.1303 1.5277 8.8521 6.6164 1.9540 2.1595 8.8854 1.3562 1.9020 2.3425 5.0577 6.1638 2.2200 1.3770 1.1530 1.2038 2.3298 3.3701 12.7145 12.6884 1.0311 1.1082 1.1089 1.1059 1.0862
irintensity: 1.1575 1.8887 15.0160 3.1608 13.7095 13.4578 0.0277 1.9960 0.0614 0.9018 1.3865 7.1058 2.2541 2.6197 40.7176 13.4070 3.1600 81.9616 22.2666 142.4298 21.6177 1.2508 7.5555 230.7242 1.2614 210.7093 127.1711 14.2626 89.4782 7.6617 36.9257 24.0915 31.0009 21.9946 67.3215 87.7547 176.9102 0.4975 0.5042 1.4444 34.8873 254.3216
temp: 298.150 k
press: 1.00000 atm
elementType: 6 1 6 7 7 7 5 1 6 1 1 1 6 7 6 7
symmnumber: 1
zpe: 298694.4 jmol-1
zpe.correction: 0.113767 hartree
zpe.thermalcorrener: 0.123989 hartree
zpe.thermalcorrenthalpy: 0.124933 hartree
zpe.thermalcorrgfe: 0.077238 hartree
zpe.sumelectzpe: -491.735375 hartree
zpe.sumelectthermal: -491.725153 hartree
zpe.sumelectthermalent: -491.724209 hartree
zpe.sumelectthermalfe: -491.771904 hartree
dipole: 10.6652 9.1204 -0.0164
dipole: 14.0331
quadrupole: -34.6132 -39.1652 -66.1309
quadrupole: 19.3796 -3.2398 3.5362
quadrupole: 12.0232 7.4713 -19.4945 19.3796 -3.2398 3.5362
hfenergy: -491.849142 hartree
pointgroup: C01 [X(C5H5B1N5)]
dipole: -1.7978119 2.7473512 -1.6400358 debye
dipolederiv: 0.141381 -0.1183965 0.0115846 -0.1254182 0.2869797 -0.0227311 0.0375376 -0.0629629 0.1185489 0.1780681 0.0132545 -0.0023623 0.0108138 0.1725578 0.0092607 -0.0185586 0.0335415 0.1966885 -0.3338697 0.4358698 -0.2031374 0.4085862 -0.7062681 0.2622919 -0.3182194 0.4708315 -0.4414246 -0.0499215 0.0574062 0.0343073 0.0689155 -0.1607149 -0.0695313 -0.0279673 0.0384486 -0.0776127 -0.0881028 0.0429808 -0.2712714 0.0554948 -0.024635 0.3902694 -0.1993816 0.2754495 -0.3208061 -0.0745063 0.0859328 0.2236822 0.1199257 -0.3225139 -0.2802271 0.3071674 -0.4421088 0.3525125 1.0643502 -0.6049231 0.2050133 -0.5993389 1.7463922 -0.0473446 0.2318894 -0.0984238 1.8376649 0.3290906 -0.0219359 -0.0533354 -0.0203602 0.385213 0.1086885 -0.042677 0.0879887 0.3818867 0.2713709 -0.1856412 0.0369765 -0.2297512 0.5098546 -0.0714675 0.0289171 -0.0560821 0.0933241 0.114165 0.0323735 0.0333223 0.0385515 0.07979 -0.0470676 0.0026545 0.0108458 0.0453812 0.0493544 0.0222345 0.0266308 -0.010687 0.006576 0.0517604 0.0416673 0.0362356 0.1076952 0.037829 -0.0143793 -0.0683279 0.0365427 0.0548292 0.0021184 -0.0580885 -0.0313057 0.0894996 -0.1850002 0.3759779 0.153608 0.3861016 -0.7917269 -0.3665455 0.2011591 -0.4509066 -0.3258336 -0.1794757 -0.1510095 -0.0766814 -0.1547236 0.0728828 0.1680005 -0.09611 0.205225 -0.1288092 -0.0292719 0.0361392 -0.0837798 0.0179604 -0.078815 -0.1561103 -0.1423018 -0.0564697 -1.1812769 -0.245461 -0.0058838 0.0337706 -0.0026131 -0.2304014 0.0686354 0.0523118 0.0396934 0.2525615 unknown
polarizability: 77.4358143|-33.8608008|116.5511983|8.9745029|1.498374|120.2410313 unknown
InChI: InChI=1/C5H5BN5/c1-11-2-5(9-10-11)6(3-7)4-8/h2,9H,1H3
charge 1 multiplicity 1
16 atoms
C  2.57777301 1.59020804 1.16609583
H  2.46453336 2.05119846 2.13469072
C  3.18910785 0.41433662 0.78999225
N  2.09267528 2.13846427 0.03189695
N  2.35124005 1.40305094 -1.02042745
N  2.99998869 0.38370664 -0.56317043
B  3.91942266 -0.66210277 1.6165656
H  3.31036912 -0.32434358 -1.2230491
C  1.32963658 3.38261138 -0.11855958
H  1.26897748 3.60277733 -1.18054939
H  0.33559928 3.23432015 0.29865722
H  1.85556474 4.17737337 0.4051826
C  4.48959008 -1.88725509 0.90573906
N  4.89533308 -2.78317671 0.30571417
C  4.04995154 -0.47950886 3.12442933
N  4.12300596 -0.31057245 4.26162307
