program: Gaussian 16
title: MeQHBFA-H+
version: ES64L-G16RevC.01
method: RwB97XD
basis: GenECP
operation: Freq
keyword: #N
keyword: Geom=AllCheck
keyword: Guess=TCheck
keyword: SCRF=Check
keyword: GenChk
keyword: RwB97XD/GenECPFreq
converged: YES YES YES YES
title: Mulliken charges:
elementType: C H C N N N B H C H H H C O O H C O O H
charge: -0.125623 0.325282 -0.386592 0.175788 0.342347 -0.428194 0.654455 0.463698 -0.357270 0.241308 0.246395 0.220778 -0.228291 -0.153535 -0.071927 0.349279 -0.164376 -0.295983 -0.153852 0.346314
chargesum: 1.00000
title: Mulliken charges with hydrogens summed into heavy atoms:
elementType: C C N N N B C C O O C O O
charge: 0.199658 -0.386592 0.175788 0.342347 0.035504 0.654455 0.351211 -0.228291 -0.153535 0.277352 -0.164376 -0.295983 0.192461
1716.lowfreq: -20.6115 -10.7299 0.0009 0.0010 0.0013 27.0720 46.6026 80.6647 92.0492
frequency: 44.7714 78.8998 91.9271 103.2758 136.3282 162.1885 193.1456 220.8858 270.1060 277.2385 308.3553 366.2059 398.4264 430.6603 530.9826 598.6113 627.4881 669.7345 687.4831 713.7246 717.6545 753.0576 773.1798 891.2164 903.0536 914.9696 1028.9671 1085.9736 1093.2324 1106.7881 1164.9930 1190.5468 1224.4084 1235.3460 1251.7384 1366.0049 1395.0519 1422.7661 1452.2371 1457.4968 1493.5552 1496.4754 1516.6294 1543.2443 1638.3137 1759.4496 1775.2914 3099.7972 3196.5467 3214.9970 3296.2244 3490.7616 3734.4150 3787.7788
redmass: 6.5709 6.6349 6.5159 5.0663 5.8175 1.1432 8.9981 5.8405 4.9838 5.9368 7.4215 8.8591 4.5497 3.8169 3.9073 1.6675 3.3175 3.5939 3.5492 6.3476 4.4313 3.3668 1.7787 1.3784 1.1213 5.8968 7.6494 2.5195 2.5967 2.6545 1.3372 2.0208 1.7879 1.6239 1.5975 7.3265 4.0260 3.8888 2.3987 2.1043 1.0719 1.9848 1.3009 4.6450 4.8475 12.2422 9.3671 1.0319 1.1075 1.1081 1.1039 1.0886 1.0647 1.0645
irintensity: 2.2897 1.8484 0.7027 0.8050 2.7414 0.7261 5.4125 23.1228 36.0345 2.8505 29.5323 17.2392 10.0506 8.1990 1.5208 118.9460 157.9612 127.7525 49.7526 23.3607 43.2737 28.2895 128.9884 6.0204 105.0171 41.8839 82.9269 8.0909 146.7342 6.0814 1.1922 536.2712 31.0019 112.6657 42.7256 7.8708 103.2769 7.6230 0.3854 20.1628 23.0900 15.5142 16.9735 66.8474 17.4536 376.5733 386.6610 3.2229 0.1378 0.5869 20.7773 477.8095 188.3861 141.6345
temp: 298.150 k
press: 1.00000 atm
elementType: 6 1 6 7 7 7 5 1 6 1 1 1 6 8 8 1 6 8 8 1
symmnumber: 1
zpe: 385093.5 jmol-1
zpe.correction: 0.146674 hartree
zpe.thermalcorrener: 0.158804 hartree
zpe.thermalcorrenthalpy: 0.159748 hartree
zpe.thermalcorrgfe: 0.107441 hartree
zpe.sumelectzpe: -684.381994 hartree
zpe.sumelectthermal: -684.369864 hartree
zpe.sumelectthermalent: -684.368920 hartree
zpe.sumelectthermalfe: -684.421227 hartree
dipole: 14.6337 5.5253 7.7312
dipole: 17.4484
quadrupole: -18.5280 -37.4118 -39.5298
quadrupole: 0.6087 34.4052 0.5835
quadrupole: 13.2952 -5.5886 -7.7066 0.6087 34.4052 0.5835
hfenergy: -684.5286681 hartree
pointgroup: C01 [X(C5H7B1N3O4)]
dipole: -0.6802487 2.1340908 0.9483138 debye
dipolederiv: -0.0175293 -0.0200124 -0.1164829 0.0153506 0.0528209 0.2043736 0.0375075 -0.0726032 0.0089552 0.1811933 0.0241999 -0.0063903 0.0199228 0.1479209 -0.0021663 -0.0139151 0.0123072 0.1548832 -0.0909494 0.1477943 -0.0043779 0.0632141 -0.1684206 -0.0922582 -0.0970488 0.1722396 -0.2263544 -0.0746266 0.0947781 0.0496517 0.1397192 -0.317241 0.0017513 0.0936299 -0.0826741 0.1750038 -0.0749152 -0.0369498 -0.2214171 -0.0379977 0.1312048 0.2673851 -0.2102109 0.2394471 -0.4532986 -0.105359 0.1679751 0.1683605 0.1996954 -0.5476305 -0.1852013 0.1831166 -0.2444049 0.2683158 0.5265258 -0.1972913 -0.1923456 -0.2644653 0.8530451 -0.3856959 0.2420983 -0.3063093 1.2407561 0.3831685 -0.1664191 0.016358 -0.1718439 0.6706438 0.0029366 -0.0290259 0.0815048 0.3656118 0.2646979 -0.1561716 0.0314465 -0.2069555 0.5204136 -0.0743496 0.0252166 -0.0616552 0.1105841 0.1143694 0.0316696 0.0254392 0.0357799 0.0702207 -0.0451189 -0.0063615 0.0192038 0.0333583 0.0227307 0.0346101 0.0350715 -0.0113451 0.0086011 0.0527335 0.0558093 0.0287218 0.0883988 0.0290929 -0.0278652 -0.0654802 0.031311 0.0247821 -0.0000227 -0.0572574 -0.0336681 0.089128 1.4592484 0.435596 0.8053109 0.5338471 0.3136555 0.3181483 0.5838045 0.1351225 1.3999184 -0.9969632 -0.2775974 -0.0393889 -0.2746009 -0.4226592 0.0209902 0.0145914 0.2304686 -1.32494 -0.7153476 -0.1149924 -0.4980121 -0.1509377 -0.3410455 -0.1971272 -0.8268404 -0.2224066 -1.182424 0.2997254 -0.061321 0.0820222 -0.055267 0.3963167 0.0312188 0.0485813 0.0071961 0.4693887 0.4206837 -0.4315772 0.2193357 -0.4241945 1.3072317 -0.2727708 0.3491097 -0.4953415 1.633914 -0.4869393 0.2258638 -0.0486245 0.1770783 -0.8421534 -0.1699206 -0.2395741 0.3171794 -1.4389017 -0.5292882 0.3440731 -0.227869 0.3959114 -1.2837246 0.5382673 -0.1511072 0.3197268 -0.6518769 0.3904817 -0.0163625 -0.0126078 -0.0142218 0.4260179 -0.0131731 -0.0021238 -0.0440546 0.2395793 unknown
polarizability: 84.9168653|-21.7446582|114.3590027|16.0652453|-5.1436967|126.8626202 unknown
InChI: InChI=1/C5H7BN3O4/c1-9-2-3(7-8-9)6(4(10)11)5(12)13-6/h2,7,10,12H,1H3
charge 1 multiplicity 1
20 atoms
C  2.6263457 1.68782994 1.18122015
H  2.57085994 2.2162294 2.11864445
C  3.15840478 0.46370134 0.85302349
N  2.11834853 2.19635943 0.03308937
N  2.29392395 1.39466818 -0.98311707
N  2.91016275 0.36881344 -0.48019027
B  3.88284809 -0.68537388 1.64693448
H  3.19052587 -0.42640347 -1.05921515
C  1.41479861 3.46485449 -0.15532863
H  1.32409155 3.63466466 -1.22474678
H  0.42895187 3.39513894 0.30084235
H  1.996205 4.25953817 0.30677238
C  4.38951087 -0.50457793 3.06742768
O  3.24866967 -0.99075381 3.19666347
O  5.23257012 -0.17594529 3.97084439
H  4.89766578 -0.37501965 4.86172299
C  4.25397401 -2.00015247 0.80278211
O  4.15070917 -2.04696157 -0.40786344
O  4.69390231 -3.02344373 1.52478491
H  4.88515007 -3.77164033 0.94032651
