program: Gaussian 16
title: cyclo_biphenylene_prot
version: AS64L-G16RevC.02
method: RwB97XD
basis: GenECP
operation: Freq
keyword: #N
keyword: Geom=AllCheck
keyword: Guess=TCheck
keyword: SCRF=Check
keyword: GenChk
keyword: RwB97XD/GenECPFreq
converged: YES YES NO NO
title: Mulliken charges:
elementType: C C C C C C C H C H H C H C H C C H N C H H H C H H H H B C H C H C H H C H H C H H H H
charge: 0.286040 0.202929 0.000020 -0.019737 -0.223097 -0.081521 -0.297989 0.232061 -0.478312 0.276080 0.211830 -0.383063 0.246654 -0.581805 0.260381 -0.242265 0.310260 0.214714 0.093665 -0.379909 0.235827 0.261995 0.262418 -0.327590 0.245681 0.261679 0.259855 0.144753 0.117053 -0.291434 0.176357 -0.267162 0.185961 -0.494086 0.197513 0.196383 -0.572606 0.178897 0.195625 -0.281619 0.150351 0.221809 0.220469 0.074932
chargesum: 1.00000
title: Mulliken charges with hydrogens summed into heavy atoms:
elementType: C C C C C C C C C C C C N C C B C C C C C
charge: 0.286040 0.202929 0.000020 -0.019737 0.008965 -0.081521 -0.021909 -0.266482 -0.136408 -0.321424 -0.027551 0.310260 0.238417 0.380332 0.439625 0.117053 0.105392 -0.006268 -0.100191 -0.198084 0.090541
1716.lowfreq: -0.0002 0.0003 0.0003 10.6372 15.1369 19.7272 47.0688 53.4037 75.5987
frequency: 44.7440 52.9177 74.2488 85.1677 111.6378 115.6329 124.8317 151.1332 177.3965 208.5914 241.9414 251.3361 275.6248 296.2169 300.3850 312.8980 329.7925 337.4450 366.7485 403.4268 435.5599 455.0357 463.6694 476.2221 491.1346 508.8055 554.1744 596.9155 614.0641 631.4784 653.6628 680.8028 706.6957 730.3474 739.4789 744.4216 773.4283 798.5031 824.4851 834.7913 850.8016 866.5766 876.4384 913.6299 918.9912 924.9275 954.9001 957.5392 1000.0416 1005.3726 1008.5587 1021.0002 1023.7081 1029.6964 1038.8871 1049.3745 1059.5749 1082.9162 1086.6352 1099.4543 1138.3823 1143.4186 1152.4699 1159.0048 1181.0070 1192.6283 1202.6820 1213.6988 1219.3540 1225.3000 1253.5501 1271.3371 1289.7248 1290.5421 1301.5096 1317.2427 1329.7554 1349.9531 1371.3070 1393.9181 1398.3955 1408.5868 1429.5139 1440.6474 1446.5606 1462.3713 1477.9575 1487.3100 1490.3794 1492.8545 1497.4277 1501.2294 1508.4983 1510.5080 1511.7507 1514.3787 1517.0658 1526.0153 1533.6202 1644.9354 1671.7335 1695.3435 1740.6387 2947.9081 2975.7544 3023.6693 3035.1274 3038.2182 3051.5666 3085.7059 3090.4506 3092.8789 3096.7441 3097.1664 3099.0246 3195.9369 3198.8560 3200.6929 3202.6346 3208.5452 3210.3615 3211.3547 3218.0776 3224.9556 3230.1642 3436.9906
redmass: 3.8344 3.0997 3.0738 3.0764 3.8876 4.4802 3.3446 3.9859 3.6454 2.5393 2.3212 1.4376 2.3251 1.6906 2.8020 1.7546 2.2799 3.1394 4.2618 3.3767 3.1635 2.9614 4.0463 3.0123 2.6131 2.4723 3.4469 5.5624 4.5063 4.1320 4.1945 3.1091 1.4537 2.5204 6.2523 4.2538 1.8396 1.6309 3.2941 3.7462 2.2603 1.4060 1.7279 2.8700 2.4643 1.3586 1.4810 2.7069 4.2572 1.3425 3.0053 1.3514 1.8678 2.1178 1.8530 1.3034 2.1360 1.4036 1.5602 1.8121 2.6488 1.7887 1.9490 1.5411 1.7598 1.8115 1.7576 1.9921 1.7995 1.5796 2.0108 1.7467 1.6759 1.3922 1.6399 1.9061 1.6682 1.6903 1.3785 1.4801 1.5653 2.1145 1.9734 1.1840 1.1114 1.1585 1.4481 1.1279 1.1486 1.0604 1.0899 1.0923 1.4079 1.3478 1.7843 1.2449 1.0809 1.2080 4.4765 8.7583 6.6086 7.8353 8.2547 1.0633 1.0706 1.0694 1.0646 1.0721 1.0811 1.1021 1.0947 1.1022 1.0316 1.0877 1.0309 1.0876 1.1080 1.1041 1.0930 1.1077 1.1070 1.0930 1.0935 1.0971 1.0974 1.0770
irintensity: 0.6382 0.3724 2.2599 1.4983 2.8532 6.9099 3.0064 1.8984 0.5731 1.0900 0.2692 0.4124 1.0531 1.0484 0.5089 0.5576 1.4788 2.2821 1.2682 1.9453 1.2760 0.7100 0.5782 2.1698 4.4561 1.7769 4.8689 3.1725 1.9145 12.1780 0.9737 8.6327 3.0377 42.6557 1.7989 8.4017 3.8421 62.0570 7.0107 0.9349 1.4136 2.0839 8.1144 26.2178 9.4283 8.6702 3.8910 19.6905 34.7671 0.0632 19.5521 0.9142 20.0449 16.9327 13.0675 4.0678 1.5645 8.2914 39.0258 2.4566 25.8282 2.4733 43.0231 32.0836 31.6871 2.5727 13.6071 3.2417 12.9583 3.8170 27.6001 8.2640 31.4376 12.8128 59.5925 25.4649 81.5427 117.8071 2.1613 2.5327 5.1804 7.0280 65.6001 12.6337 22.4417 11.0652 14.3011 0.5451 8.4582 1.1376 8.4659 15.5497 3.8065 0.7591 3.6453 9.9846 45.6776 63.1718 0.4713 43.0712 34.8320 10.5822 0.6663 59.2322 18.1522 31.5200 39.4507 35.3626 61.4682 43.0773 66.1290 52.2433 3.1585 33.5402 1.1425 1.3799 2.3595 2.0437 0.6793 3.0021 0.4059 9.5324 2.1173 9.9215 2.6512 369.9383
temp: 298.150 k
press: 1.00000 atm
elementType: 6 6 6 6 6 6 6 1 6 1 1 6 1 6 1 6 6 1 7 6 1 1 1 6 1 1 1 1 5 6 1 6 1 6 1 1 6 1 1 6 1 1 1 1
symmnumber: 1
zpe: 1009780.5 jmol-1
zpe.correction: 0.384605 hartree
zpe.thermalcorrener: 0.402931 hartree
zpe.thermalcorrenthalpy: 0.403875 hartree
zpe.thermalcorrgfe: 0.338973 hartree
zpe.sumelectzpe: -816.797958 hartree
zpe.sumelectthermal: -816.779632 hartree
zpe.sumelectthermalent: -816.778688 hartree
zpe.sumelectthermalfe: -816.843589 hartree
dipole: 4.7644 -6.9249 -0.4292
dipole: 8.4165
quadrupole: -88.7125 -78.8068 -121.7203
quadrupole: -8.5741 -1.9874 3.5953
quadrupole: 7.7007 17.6064 -25.3071 -8.5741 -1.9874 3.5953
hfenergy: -817.1825627 hartree
pointgroup: C01 [X(C19H23B1N1)]
dipole: 1.8712504 -2.8128344 -0.1792775 debye
polarizability: 345.0171242|-17.6930865|308.9858259|-17.1604702|22.7548999|170.6839534 unknown
InChI: InChI=1/C19H23BN/c1-21(2)17-11-7-9-15-14-8-6-10-16(18(14)19(15)17)20-12-4-3-5-13-20/h6-11,21H,3-5,12-13H2,1-2H3
charge 1 multiplicity 1
44 atoms
C  0.37794602 1.26584173 0.20957757
C  1.26529701 2.36376245 0.24191441
C  2.43796043 1.45696646 0.01731343
C  1.56579467 0.33788717 -0.00438768
C  3.7898609 1.35604973 -0.12532224
C  2.08397689 -0.91370292 -0.15462833
C  4.30248754 0.04724697 -0.29421631
H  4.45087055 2.21297218 -0.10711735
C  3.48110995 -1.05907232 -0.30624605
H  5.37002636 -0.09352603 -0.4115324
H  3.91906704 -2.04239626 -0.43253511
C  0.84563037 3.65044495 0.4345513
H  1.51759701 4.49942594 0.45196811
C  -0.54345133 3.80973546 0.61562341
H  -0.94586779 4.80355182 0.77352667
C  -1.40665342 2.72823529 0.60440975
C  -0.98859351 1.38215058 0.38615513
H  -2.46291817 2.92199421 0.75262428
N  1.22279906 -2.10650418 -0.14443022
C  1.30219291 -2.89970743 -1.41060166
H  2.27256123 -3.38789021 -1.46518536
H  0.50642415 -3.6430208 -1.39592243
H  1.17425812 -2.22009091 -2.25069501
C  1.43051109 -2.95558444 1.06971022
H  0.70249766 -3.76589569 1.05255881
H  2.44169988 -3.35568502 1.04909104
H  1.29275169 -2.33346851 1.95136567
H  0.2617698 -1.75597053 -0.10089312
B  -2.04951299 0.23253876 0.30309711
C  -3.41207908 0.28222522 1.07905081
H  -3.65479415 1.2611478 1.50006031
C  -1.80265295 -1.06599076 -0.57035869
H  -0.97718199 -0.94873167 -1.28464924
C  -3.07344539 -1.51459297 -1.32251418
H  -3.29418229 -0.78745911 -2.11242239
H  -2.89767147 -2.47112226 -1.82324922
C  -4.60367603 -0.28390517 0.28231787
H  -4.8922899 0.43742129 -0.49169524
H  -5.47306967 -0.39682851 0.93577106
C  -4.27700565 -1.61907384 -0.3862124
H  -4.07385837 -2.37454955 0.38435394
H  -5.14594731 -1.97314173 -0.94804236
H  -3.24036642 -0.37051986 1.95399486
H  -1.56080746 -1.87917634 0.14023622
