program: Gaussian 16
title: MeQHBCCH-H+
version: ES64L-G16RevC.01
method: RwB97XD
basis: GenECP
operation: Freq
keyword: #N
keyword: Geom=AllCheck
keyword: Guess=TCheck
keyword: SCRF=Check
keyword: GenChk
keyword: RwB97XD/GenECP
keyword: Freq
converged: YES YES NO NO
title: Mulliken charges:
elementType: C H C N N N B H C H H H C C H C C H
charge: -0.418665 0.335839 -0.247180 0.208607 0.128652 -0.171745 0.455474 0.471384 -0.379221 0.236435 0.247046 0.223646 -0.293389 -0.193334 0.345448 0.153255 -0.434657 0.332403
chargesum: 1.00000
title: Mulliken charges with hydrogens summed into heavy atoms:
elementType: C C N N N B C C C C C
charge: -0.082826 -0.247180 0.208607 0.128652 0.299639 0.455474 0.327906 -0.293389 0.152114 0.153255 -0.102254
1716.lowfreq: -22.4148 -5.8661 -0.0006 -0.0003 0.0004 26.6571 75.2106 85.1946 91.3156
frequency: 68.0989 84.1602 90.9061 106.3092 110.1341 194.4198 249.1149 270.8503 302.2713 372.1167 407.5493 468.6125 517.4905 594.6181 690.7538 710.2374 724.5211 732.8882 739.5535 817.9617 820.0888 827.2585 866.6021 932.0765 1086.9303 1097.7089 1103.8418 1157.8904 1162.3444 1210.7921 1274.0897 1374.2855 1410.0481 1451.2971 1473.9018 1490.1218 1510.1845 1513.0556 1640.5947 2183.7971 2188.5631 3099.7496 3199.0160 3215.6104 3298.7478 3448.6612 3451.9265 3610.3766
redmass: 3.5314 4.0273 1.1272 4.5533 4.0980 3.8922 4.6665 4.8088 4.6574 4.2245 5.7600 4.4463 7.2767 6.5430 3.3858 4.6817 10.1891 1.2990 1.2997 1.1422 1.3150 1.3157 1.5029 7.9911 4.2676 2.7185 1.6995 1.3667 7.1367 2.0663 1.9929 7.6121 4.2925 2.3251 1.4924 1.1097 1.9833 1.4141 3.9561 5.7980 5.8394 1.0314 1.1079 1.1084 1.1044 1.1663 1.1661 1.0853
irintensity: 0.9739 0.5918 0.0463 0.5571 0.5824 6.1129 2.3795 0.3972 17.6597 10.7179 7.7824 1.7986 14.9114 13.0801 47.0430 5.9475 8.7284 45.5491 57.3519 73.0754 35.4792 34.0538 21.7955 171.0119 21.6544 2.6092 27.8377 1.3870 307.1621 224.6321 141.6395 10.7785 30.8156 1.0264 18.4408 21.9429 18.6105 18.7153 29.1509 183.8549 399.4754 2.0380 0.0787 0.7268 23.8984 64.9414 57.8271 216.6919
temp: 298.150 k
press: 1.00000 atm
elementType: 6 1 6 7 7 7 5 1 6 1 1 1 6 6 1 6 6 1
symmnumber: 1
zpe: 355004.6 jmol-1
zpe.correction: 0.135214 hartree
zpe.thermalcorrener: 0.146035 hartree
zpe.thermalcorrenthalpy: 0.146979 hartree
zpe.thermalcorrgfe: 0.098025 hartree
zpe.sumelectzpe: -459.550750 hartree
zpe.sumelectthermal: -459.539929 hartree
zpe.sumelectthermalent: -459.538985 hartree
zpe.sumelectthermalfe: -459.587940 hartree
dipole: 13.2213 5.2850 2.8471
dipole: 14.5204
quadrupole: -17.3595 -28.7187 -38.8135
quadrupole: -0.3746 8.9544 7.5959
quadrupole: 10.9378 -0.4215 -10.5163 -0.3746 8.9544 7.5959
hfenergy: -459.6859644 hartree
pointgroup: C01 [X(C7H7B1N3)]
dipole: -0.8231004 1.2842173 -0.557523 debye
dipolederiv: 0.0503573 -0.0567863 -0.0694566 -0.043967 0.1353475 0.1143504 0.0298433 -0.05223 0.0540273 0.1780504 0.0174746 0.0016119 0.0155351 0.1596027 -0.0056652 -0.0120912 0.0158527 0.1741044 -0.1951573 0.2845147 -0.0905099 0.242396 -0.431234 0.0663748 -0.2543925 0.3625493 -0.3842944 -0.0695882 0.0835893 0.0479919 0.1104035 -0.2333406 -0.0427567 0.0343075 -0.0228147 0.0959383 -0.0887846 0.0164942 -0.2584453 0.0138065 0.0104423 0.3294245 -0.2317025 0.2969282 -0.4615603 -0.1122705 0.1098408 0.194396 0.1448243 -0.3675646 -0.2244661 0.2580762 -0.3589388 0.3320153 0.9048449 -0.6283643 0.1591337 -0.6206243 1.733639 0.1970993 0.1878879 0.1454312 2.0950683 0.3300927 -0.0329122 -0.0294509 -0.0346636 0.3894757 0.0620452 -0.029837 0.0609538 0.3616705 0.2800255 -0.1816789 0.0374355 -0.2255555 0.5126555 -0.0736331 0.0271828 -0.0539251 0.1016938 0.1103371 0.0327314 0.0321672 0.0390765 0.0747396 -0.0427305 -0.0026062 0.0192591 0.0344542 0.0278155 0.0310463 0.0284589 -0.0115605 0.0056979 0.0515716 0.0474582 0.0328677 0.0999142 0.0345165 -0.0196303 -0.0675007 0.034977 0.0352437 -0.0008585 -0.0564013 -0.0364141 0.0860888 -0.315049 0.0234599 -0.1508232 0.0204181 -0.3531395 -0.113756 -0.1608732 -0.1014731 -1.5585549 -0.0909456 0.0353065 0.0333735 0.0352408 -0.1438858 0.0025512 0.0310001 -0.0009976 0.1052933 0.2299138 -0.0202897 0.0089327 -0.0189155 0.2572328 0.0129447 0.0175181 0.0057944 0.3388048 -0.4542098 0.3948065 0.1748302 0.3919855 -1.1303045 -0.4289044 0.1762516 -0.4296193 -0.6175328 -0.0601654 -0.0500836 -0.0496478 -0.051544 0.0412631 0.0705599 -0.0505471 0.0744704 -0.1439609 0.2402164 -0.0395188 -0.002497 -0.0418331 0.3041293 0.0258488 -0.0110746 0.0423059 0.2868301 unknown
polarizability: 85.2079444|-35.6207097|131.4261506|7.6029616|11.7708359|147.8680178 unknown
InChI: InChI=1/C7H7BN3/c1-4-8(5-2)7-6-11(3)10-9-7/h1-2,6,9H,3H3
charge 1 multiplicity 1
18 atoms
C  2.57800607 1.59238173 1.17697444
H  2.45407916 2.06424268 2.13780698
C  3.19508054 0.4151556 0.8248995
N  2.10032695 2.12686267 0.02968942
N  2.3689662 1.38225188 -1.01097273
N  3.01771316 0.36942221 -0.52438631
B  3.93582848 -0.68286877 1.65830649
H  3.34065821 -0.35424901 -1.15870739
C  1.33653956 3.3644739 -0.13868264
H  1.2746147 3.57137614 -1.20341004
H  0.34157985 3.22313888 0.27931956
H  1.85884896 4.16846833 0.37494834
C  4.08110404 -0.48530077 3.14389846
C  4.19203168 -0.32374989 4.33467921
H  4.29640364 -0.19554649 5.38936035
C  4.46003426 -1.88891307 0.91632653
C  4.86221046 -2.83615999 0.28547497
H  5.22847379 -3.68483429 -0.24895652
