program: Gaussian 16
title: f_biphenylene_prot
version: AS64L-G16RevC.02
method: RwB97XD
basis: GenECP
operation: Freq
keyword: #N
keyword: Geom=AllCheck
keyword: Guess=TCheck
keyword: SCRF=Check
keyword: GenChk
keyword: RwB97XD/GenECP
keyword: Freq
converged: YES YES NO YES
title: Mulliken charges:
elementType: C C C C C C C H C H H C H C H C C H B N C H H H C H H H F F H
charge: 0.169875 0.218672 -0.422606 -0.005832 -0.158911 0.231443 -0.266236 0.235013 -0.587491 0.279835 0.199071 -0.359065 0.239929 -0.336981 0.265478 0.193930 -0.490643 0.268429 0.322207 -0.022535 -0.352869 0.233758 0.235830 0.253753 -0.404363 0.234861 0.252652 0.238155 -0.081820 -0.009775 0.426236
chargesum: 1.00000
title: Mulliken charges with hydrogens summed into heavy atoms:
elementType: C C C C C C C C C C C C B N C C F F
charge: 0.169875 0.218672 -0.422606 -0.005832 0.076102 0.231443 0.013599 -0.388420 -0.119136 -0.071503 0.462358 -0.490643 0.322207 0.403701 0.370472 0.321306 -0.081820 -0.009775
1716.lowfreq: -30.0684 -0.0004 -0.0004 0.0004 13.3021 22.2708 46.9359 66.2850 90.9786
frequency: 42.9748 65.7419 90.4395 110.5484 118.2856 124.2461 136.2191 156.3167 181.7951 250.1777 270.3981 291.4604 307.7312 329.8775 359.7797 362.6639 445.8787 449.7428 463.7726 487.8005 555.1509 566.9431 604.4291 625.7757 629.5146 660.4882 694.2502 740.5492 750.2910 780.6138 790.5570 811.4342 841.8621 884.7701 948.9947 950.1748 969.6636 1004.7507 1012.9707 1019.1440 1026.7384 1053.8708 1059.6332 1061.9127 1106.5531 1148.3528 1154.9641 1171.8201 1177.4244 1199.1053 1211.1770 1246.0229 1266.6391 1285.8350 1296.3507 1312.4110 1384.4137 1415.1230 1433.6981 1439.5474 1447.0884 1479.1502 1484.3703 1487.0578 1495.1589 1506.9079 1511.2185 1514.5333 1521.7856 1536.5901 1658.4502 1675.7644 1699.8677 1747.2988 3087.6693 3093.8348 3190.2411 3197.8794 3201.2016 3203.1452 3205.6937 3210.6998 3215.5963 3223.7580 3227.0590 3232.9478 3443.0016
redmass: 4.4548 4.1178 5.1503 3.2838 7.6991 3.7259 3.5166 1.4493 3.6544 1.2085 4.4967 3.3247 3.3727 6.7505 4.7137 5.0781 4.6815 5.0148 4.2013 3.8099 3.4388 7.7415 6.4319 5.6047 5.0651 4.0351 6.5362 6.4486 2.8617 6.5521 1.6268 1.6753 3.4303 4.7756 1.5162 2.8082 1.3810 7.3166 1.4871 1.8538 1.3545 3.1987 2.7771 1.2513 2.1692 1.6876 2.7450 1.8399 1.9737 1.9527 1.4647 2.0770 1.7842 2.9814 2.7203 2.6128 5.6792 2.1828 1.9528 1.1354 1.1981 1.1820 1.0391 1.5166 1.0740 1.0535 1.7570 2.3811 1.4131 5.1644 8.8686 6.7613 7.8666 8.5352 1.0313 1.0314 1.1084 1.1085 1.0889 1.1088 1.1083 1.0881 1.0932 1.0934 1.0974 1.0973 1.0777
irintensity: 4.3409 0.1603 1.2604 3.4346 8.6591 1.0282 4.1365 0.6790 0.0573 0.0906 6.1640 1.8582 1.1685 1.1040 3.0545 1.5341 4.7816 2.7866 0.1051 8.1696 3.3200 25.5261 2.7996 13.3102 21.2162 6.6572 22.4221 1.4201 83.7639 3.2049 0.1368 55.1798 0.2249 1.2164 11.3798 26.8487 0.8445 26.0756 1.4166 16.4564 0.3011 58.9118 0.3404 7.1519 84.3111 5.4599 70.4208 3.7272 2.9264 6.6476 36.9690 64.5093 0.8757 42.7878 180.0967 222.0733 547.8635 36.8379 102.1774 0.7160 7.3286 8.9081 1.3958 18.3788 29.3875 22.0749 11.8202 19.3787 84.5206 0.9651 65.1676 71.8023 21.0206 9.8381 1.7924 4.0128 0.1066 2.5423 0.0903 1.1854 1.0546 2.4631 3.0894 1.2011 5.3763 0.9147 262.6121
temp: 298.150 k
press: 1.00000 atm
elementType: 6 6 6 6 6 6 6 1 6 1 1 6 1 6 1 6 6 1 5 7 6 1 1 1 6 1 1 1 9 9 1
symmnumber: 1
zpe: 650994.3 jmol-1
zpe.correction: 0.247951 hartree
zpe.thermalcorrener: 0.263321 hartree
zpe.thermalcorrenthalpy: 0.264266 hartree
zpe.thermalcorrgfe: 0.205143 hartree
zpe.sumelectzpe: -820.190235 hartree
zpe.sumelectthermal: -820.174864 hartree
zpe.sumelectthermalent: -820.173920 hartree
zpe.sumelectthermalfe: -820.233042 hartree
dipole: -7.0723 -2.2052 0.4068
dipole: 7.4193
quadrupole: -61.5743 -71.6331 -98.4080
quadrupole: 17.8298 -2.4422 -1.1368
quadrupole: 15.6309 5.5721 -21.2029 17.8298 -2.4422 -1.1368
hfenergy: -820.4381856 hartree
pointgroup: C01 [X(C14H13B1F2N1)]
dipole: -2.8157151 -0.9101908 0.1253208 debye
polarizability: 289.8240634|2.4511263|221.6022866|-10.916224|-0.4180328|110.9784368 unknown
InChI: InChI=1/C14H13BF2N/c1-18(2)12-8-4-6-10-9-5-3-7-11(15(16)17)13(9)14(10)12/h3-8,18H,1-2H3
charge 1 multiplicity 1
31 atoms
C  0.92796835 0.56457724 -0.01532199
C  0.95797322 1.97430083 -0.02826782
C  -0.54375837 2.01948605 0.06264145
C  -0.58004239 0.60267991 0.07742585
C  -1.66788422 2.78976725 0.11523577
C  -1.77038577 -0.05488886 0.14651192
C  -2.89587564 2.089234 0.18498597
H  -1.64675914 3.87182067 0.10291447
C  -2.95457106 0.71080264 0.19878116
H  -3.82198084 2.64922556 0.22718474
H  -3.92082851 0.22258297 0.2476107
C  2.12665125 2.67888264 -0.11100738
H  2.1673761 3.76090602 -0.12424864
C  3.30746234 1.90510959 -0.18092204
H  4.26355169 2.41019439 -0.24732511
C  3.27793651 0.52367283 -0.16775126
C  2.06276385 -0.21348476 -0.08384398
H  4.2139981 -0.0200583 -0.22436704
B  2.05265035 -1.74903581 -0.07717219
N  -1.83476514 -1.52487655 0.13926627
C  -2.53318376 -2.0855789 1.3386708
H  -3.58813508 -1.82484314 1.29005639
H  -2.41437433 -3.16773106 1.32984903
H  -2.08127018 -1.65854739 2.23102346
C  -2.39940419 -2.05211764 -1.14410911
H  -2.32774828 -3.13812804 -1.13337493
H  -3.43853865 -1.74037308 -1.22267928
H  -1.8190949 -1.63906867 -1.96642922
F  0.8853797 -2.42956787 -0.00367556
F  3.1368738 -2.49324886 -0.14169231
H  -0.86503379 -1.85224865 0.18442887
