program: Gaussian 16
title: MeQClBF2-H+
version: ES64L-G16RevC.01
method: RwB97XD
basis: GenECP
operation: Freq
keyword: #N
keyword: Geom=AllCheck
keyword: Guess=TCheck
keyword: SCRF=Check
keyword: GenChk
keyword: RwB97XD/GenECP
keyword: Freq
converged: YES YES YES YES
title: Mulliken charges:
elementType: C C N N N B H C H H H F F Cl
charge: -0.261262 -0.723846 0.305271 0.106735 -0.164374 0.237096 0.480055 -0.416166 0.234175 0.243417 0.259245 0.079369 0.066807 0.553477
chargesum: 1.00000
title: Mulliken charges with hydrogens summed into heavy atoms:
elementType: C C N N N B C F F Cl
charge: -0.261262 -0.723846 0.305271 0.106735 0.315681 0.237096 0.320671 0.079369 0.066807 0.553477
1716.lowfreq: -7.3754 0.0021 0.0027 0.0029 27.5805 34.3283 65.8590 111.6116 120.6282
frequency: 62.6484 110.5339 119.9544 218.4493 230.2992 263.8653 301.2746 317.0891 332.4631 518.0757 544.2429 608.4889 614.2027 709.3512 740.9229 755.5031 813.7636 1047.9186 1099.5440 1157.1822 1161.0899 1253.0597 1296.2967 1373.3159 1421.9561 1429.8393 1450.8094 1485.3022 1492.5593 1505.1534 1532.7213 1637.5719 3098.9492 3195.7691 3217.7531 3625.2117
redmass: 17.5555 9.3163 4.4334 1.3485 3.1986 8.5498 4.6719 5.5487 12.4414 6.3216 8.1335 10.9071 11.6327 9.8315 8.9384 6.3723 1.1520 7.3240 1.8526 3.8939 1.5114 5.3214 2.8833 6.2532 3.8641 4.3846 3.3163 1.0704 1.7581 1.3573 2.4728 3.9873 1.0310 1.1080 1.1076 1.0849
irintensity: 0.1144 1.3969 0.5320 0.0911 0.1538 5.0603 9.9737 8.2274 12.2864 1.9443 10.1485 30.5989 29.6620 0.0402 38.5477 33.7419 91.9217 64.2838 29.1564 111.4551 23.7867 53.5236 290.1446 67.9897 100.1086 99.7168 225.7726 30.6189 30.7250 63.8640 161.7945 104.4839 0.0161 0.3184 2.0027 288.2675
temp: 298.150 k
press: 1.00000 atm
elementType: 6 6 7 7 7 5 1 6 1 1 1 9 9 17
symmnumber: 1
zpe: 243698.0 jmol-1
zpe.correction: 0.092820 hartree
zpe.thermalcorrener: 0.101841 hartree
zpe.thermalcorrenthalpy: 0.102785 hartree
zpe.thermalcorrgfe: 0.057594 hartree
zpe.sumelectzpe: -965.502800 hartree
zpe.sumelectthermal: -965.493779 hartree
zpe.sumelectthermalent: -965.492834 hartree
zpe.sumelectthermalfe: -965.538025 hartree
dipole: 11.5539 7.5568 0.8724
dipole: 13.8333
quadrupole: -27.0338 -33.9405 -53.9012
quadrupole: 12.1990 0.5527 5.1771
quadrupole: 11.2580 4.3513 -15.6094 12.1990 0.5527 5.1771
hfenergy: -965.5956194 hartree
pointgroup: C01 [X(C3H4B1Cl1F2N3)]
dipole: -0.8390699 0.9914168 -1.6460157 debye
dipolederiv: 0.108746 -0.1122297 -0.1601978 -0.087458 0.4203174 0.5966435 -0.0854372 0.4554258 1.0748099 -0.2346126 0.3189243 -0.0237521 0.2431619 -0.5091039 -0.0640429 -0.2662276 0.3730554 -0.3952563 -0.0451479 0.0937692 0.0188708 0.111737 -0.212713 -0.043195 0.1033959 -0.1918379 -0.0358714 -0.0443402 -0.0484012 -0.1787713 -0.0534859 0.1196472 0.1702688 -0.2032356 0.2269392 -0.4803063 -0.0928171 0.1184425 0.1964124 0.1350518 -0.3915606 -0.2582907 0.2461423 -0.3514865 0.2130509 1.304376 -0.7527424 0.2221346 -0.7158398 2.1558723 -0.0140076 0.3452416 -0.2354627 1.926609 0.3341718 -0.0248483 -0.0638686 -0.0217186 0.4099052 0.1231982 -0.0574512 0.1122604 0.3664837 0.2512169 -0.173531 0.0517226 -0.1707597 0.4345275 -0.1112619 0.0157598 -0.0508553 0.1078854 0.1270218 0.0290823 0.0092721 0.0152892 0.0829565 -0.0518953 -0.022196 -0.0002359 0.0491661 0.0781163 0.0176322 0.0303936 -0.0143785 0.0337877 0.065667 0.063602 0.0352777 0.0787046 0.0104712 -0.0048839 -0.0436244 0.0286878 0.0539067 0.0105539 -0.042284 -0.0190327 0.1234656 -0.3961841 0.1269532 -0.1722257 0.1035637 -0.4725306 0.0320096 -0.2423625 0.1577152 -1.0721623 -0.4906234 0.3704315 0.0535318 0.37492 -1.0555237 -0.1852263 0.0762127 -0.2252881 -0.5380906 0.0896054 0.0414014 0.0601019 0.0512291 -0.0694886 -0.2704213 0.0688399 -0.2864748 -0.4184882 unknown
polarizability: 60.6747221|-20.7555625|87.76213|5.0215675|5.5330025|94.0845457 unknown
InChI: InChI=1/C3H4BClF2N3/c1-10-3(5)2(4(6)7)8-9-10/h8H,1H3
charge 1 multiplicity 1
14 atoms
C  2.55442676 1.61045575 1.17394144
C  3.15215565 0.42099344 0.8141261
N  2.05490445 2.14794702 0.0281473
N  2.29912328 1.38857874 -1.00736871
N  2.94411457 0.37236964 -0.52925632
B  3.91047835 -0.679291 1.62295058
H  3.23556315 -0.35682134 -1.17199823
C  1.33751168 3.4144915 -0.13526163
H  1.04488997 3.48460344 -1.17902419
H  0.46015579 3.40701742 0.50889644
H  2.00480079 4.23219585 0.1333738
F  4.09577796 -0.54200487 2.90915613
F  4.35674774 -1.7323503 0.97678102
Cl 2.39911999 2.35871786 2.67259094
