program: Gaussian 16
title: MeQCNBF2-H+
version: ES64L-G16RevC.01
method: RwB97XD
basis: GenECP
operation: Freq
keyword: #N
keyword: Geom=AllCheck
keyword: Guess=TCheck
keyword: SCRF=Check
keyword: GenChk
keyword: RwB97XD/GenECPFreq
converged: YES YES YES YES
title: Mulliken charges:
elementType: C C N N N B H C H H H F F C N
charge: 0.981971 -0.631709 0.218450 0.158706 -0.176132 0.294960 0.486776 -0.413124 0.244185 0.247106 0.269304 0.081942 0.073961 -0.713566 -0.122829
chargesum: 1.00000
title: Mulliken charges with hydrogens summed into heavy atoms:
elementType: C C N N N B C F F C N
charge: 0.981971 -0.631709 0.218450 0.158706 0.310643 0.294960 0.347471 0.081942 0.073961 -0.713566 -0.122829
1716.lowfreq: -20.5636 -0.0006 0.0004 0.0007 18.9321 44.2040 70.6912 100.1572 123.3273
frequency: 66.1786 99.9848 122.5185 147.4134 169.9085 210.0674 296.4454 320.2614 336.0646 422.2871 494.3382 570.4372 596.3179 618.7946 643.9687 722.1977 762.4227 767.1052 827.4020 1058.0374 1109.3596 1162.3730 1188.2062 1272.9805 1296.5620 1375.2071 1425.4676 1444.7052 1458.1096 1479.4541 1501.0678 1507.3459 1545.9705 1658.4281 2419.5033 3097.3505 3195.9964 3221.1372 3614.6073
redmass: 14.8493 10.8583 2.6201 2.0404 2.5344 8.3332 4.7437 8.1717 6.4762 6.3845 8.8389 10.6249 6.5714 11.4843 10.0729 10.1946 7.9822 6.7885 1.1588 7.9379 1.7290 1.3405 5.4922 4.6899 3.3703 7.8018 3.0614 2.3380 6.2402 1.1350 1.9278 1.1934 2.7601 5.3585 12.6497 1.0309 1.1085 1.1078 1.0856
irintensity: 0.8455 3.9936 0.9153 1.6895 3.0543 5.6851 12.5851 13.6768 7.5444 1.6849 0.4933 16.5907 7.9819 36.9426 12.9082 3.2944 36.0858 26.1035 92.1126 64.8171 16.6350 0.2276 157.6808 1.3163 206.9104 124.7112 50.2222 131.5600 294.0661 42.5986 24.8849 25.6344 39.4423 58.1111 2.3021 0.5548 1.3658 2.9812 315.5103
temp: 298.150 k
press: 1.00000 atm
elementType: 6 6 7 7 7 5 1 6 1 1 1 9 9 6 7
symmnumber: 1
zpe: 264530.1 jmol-1
zpe.correction: 0.100754 hartree
zpe.thermalcorrener: 0.110474 hartree
zpe.thermalcorrenthalpy: 0.111418 hartree
zpe.thermalcorrgfe: 0.064886 hartree
zpe.sumelectzpe: -598.106797 hartree
zpe.sumelectthermal: -598.097077 hartree
zpe.sumelectthermalent: -598.096133 hartree
zpe.sumelectthermalfe: -598.142665 hartree
dipole: 11.9589 6.0826 -1.7692
dipole: 13.5331
quadrupole: -22.2404 -37.0332 -65.1676
quadrupole: 8.5240 -4.6068 -5.1032
quadrupole: 19.2400 4.4472 -23.6872 8.5240 -4.6068 -5.1032
hfenergy: -598.2075508 hartree
pointgroup: C01 [X(C4H4B1F2N4)]
dipole: -0.7077855 0.472915 -2.6569962 debye
dipolederiv: 0.2223438 -0.0381201 -0.074735 -0.0095637 0.2942267 0.1925621 0.0134788 0.0354888 0.4106208 -0.1765666 0.2529106 -0.0360203 0.1910146 -0.3709564 0.0217856 -0.2442395 0.3944472 -0.183331 -0.0411034 0.1011621 0.0495535 0.1016219 -0.1841815 -0.0178978 0.0860802 -0.0830476 0.2232751 -0.0274227 -0.0466217 -0.1103871 -0.0532569 0.090455 0.0581544 -0.1392531 0.1219992 -0.4538215 -0.1067673 0.1122469 0.126316 0.1287417 -0.3599708 -0.1825383 0.1819086 -0.282112 0.0570048 1.2783508 -0.7333986 0.1673953 -0.6943521 2.1537801 0.0517257 0.321481 -0.2242374 1.9026367 0.3381337 -0.0273379 -0.0726513 -0.0229536 0.4201284 0.1405674 -0.0636167 0.1254708 0.3819848 0.2382027 -0.1815869 0.0489219 -0.16538 0.4137208 -0.1047812 0.0145163 -0.0519935 0.0993206 0.130725 0.0320364 0.0102113 0.0137618 0.0812645 -0.0578235 -0.0207522 -0.008482 0.0604685 0.0967313 0.0182036 0.0291271 -0.0084334 0.0405889 0.0681706 0.0486266 0.0437837 0.0773141 0.0134186 0.0011315 -0.0451738 0.0301156 0.0672765 0.0074433 -0.0399117 -0.0126172 0.1277351 -0.3820907 0.1233567 -0.1452884 0.1070504 -0.4723761 0.0131697 -0.2221079 0.1425333 -1.0399932 -0.479159 0.3660604 0.0642396 0.3676335 -1.0482397 -0.2039163 0.0688353 -0.2116133 -0.5353876 0.1394561 0.0286965 0.0077399 0.0223053 0.0714343 -0.0841659 0.0137008 -0.0851473 -0.0819503 -0.2442524 -0.0087394 -0.0192485 -0.008305 -0.1971507 0.0975443 -0.0187464 0.0955274 -0.0458769 unknown
polarizability: 60.4412465|-21.0302792|90.1159703|3.0641748|11.4383725|103.3953565 unknown
InChI: InChI=1/C4H4BF2N4/c1-11-3(2-8)4(5(6)7)9-10-11/h9H,1H3
charge 1 multiplicity 1
15 atoms
C  2.56052148 1.61379018 1.18365699
C  3.1583167 0.42747468 0.81822508
N  2.06011127 2.15697539 0.03672235
N  2.3069672 1.40770878 -0.99477443
N  2.95554309 0.38485551 -0.52224491
B  3.90448961 -0.68061508 1.64619872
H  3.24886842 -0.34010237 -1.16998499
C  1.33270967 3.42282747 -0.11643841
H  0.99614126 3.47831983 -1.14781197
H  0.48410701 3.41758724 0.56545462
H  2.00972858 4.24409021 0.11372905
F  4.06179602 -0.5205233 2.93066504
F  4.35133544 -1.73589512 1.01220741
C  2.42763473 2.23754926 2.449147
N  2.3097937 2.76099928 3.46483974
