program: Gaussian 16
title: Me_F-H+
version: ES64L-G16RevC.01
method: RwB97XD
basis: GenECP
operation: Freq
keyword: #N
keyword: Geom=AllCheck
keyword: Guess=TCheck
keyword: SCRF=Check
keyword: GenChk
keyword: RwB97XD/GenECP
keyword: Freq
converged: YES YES YES YES
title: Mulliken charges:
elementType: C C C C C C H H H H N B C H H H C H H H H F F
charge: -0.261960 -0.067693 -0.528136 0.176929 -0.226364 -0.395199 0.262876 0.281273 0.216639 0.279393 -0.162724 0.308056 -0.376275 0.234864 0.233567 0.234590 -0.367443 0.230703 0.231445 0.236707 0.452889 -0.041278 0.047140
chargesum: 1.00000
title: Mulliken charges with hydrogens summed into heavy atoms:
elementType: C C C C C C N B C C F F
charge: 0.000916 0.213580 -0.528136 0.176929 -0.009725 -0.115806 0.290165 0.308056 0.326746 0.331413 -0.041278 0.047140
1716.lowfreq: -18.5122 0.0008 0.0010 0.0011 17.3314 36.0159 57.9274 112.1433 122.1837
frequency: 57.4233 111.4897 120.8488 161.7440 169.1604 232.0542 262.7441 298.3543 321.8206 347.9283 352.7708 430.3714 437.6269 524.3854 556.4570 565.2169 617.7570 651.2193 714.7648 779.3876 789.7386 807.7407 927.0048 929.1799 1017.9677 1022.5187 1051.5223 1058.3835 1082.0016 1087.7516 1142.2483 1166.8294 1188.7264 1205.0565 1235.6841 1276.1454 1293.8362 1321.8911 1342.1766 1374.8338 1453.0940 1458.0860 1474.6465 1482.7234 1495.6954 1505.4168 1508.4192 1522.7808 1527.7494 1547.4065 1646.5465 1691.4111 3095.4248 3100.0970 3198.9143 3201.5839 3208.4359 3212.3792 3213.5376 3218.3519 3226.1461 3234.7499 3464.5659
redmass: 4.3757 5.6321 3.9928 4.3106 4.2544 2.6638 1.2827 3.6828 1.1253 3.6744 5.5629 3.8876 3.8872 4.4808 7.3358 3.2373 4.3592 6.0301 5.4454 4.2649 4.9283 1.3109 1.5136 2.5227 1.7856 1.6048 1.3413 7.2452 2.3287 1.2382 1.9592 1.6580 1.9104 1.1283 1.5680 1.8254 3.4328 2.1127 3.9983 5.4828 1.1328 1.4499 1.1790 1.1467 1.1048 1.2717 1.4488 1.0754 1.1117 2.1280 5.4708 5.7036 1.0318 1.0308 1.1097 1.1079 1.1085 1.0927 1.1025 1.0911 1.0948 1.0996 1.0774
irintensity: 0.0345 0.2767 2.1033 7.8072 3.7984 0.9037 1.3375 0.4515 1.3935 1.3704 6.3919 0.3840 0.6314 8.3591 24.6115 21.7691 8.4173 84.7596 3.0673 0.1862 0.3362 46.6004 2.5376 9.1162 9.1303 14.3883 0.0303 61.4872 8.9528 3.1774 36.2620 20.4097 4.5251 0.8619 22.9734 10.6890 256.1753 199.1423 91.8462 475.2894 2.9097 26.8069 5.1269 6.1903 10.2424 14.5789 49.5576 32.5790 57.1176 32.8050 16.4758 92.8601 2.2101 1.3488 2.0303 0.4608 2.1254 0.5001 0.1120 1.1674 1.5039 0.7072 221.6058
temp: 298.150 k
press: 1.00000 atm
elementType: 6 6 6 6 6 6 1 1 1 1 7 5 6 1 1 1 6 1 1 1 1 9 9
symmnumber: 1
zpe: 500774.3 jmol-1
zpe.correction: 0.190735 hartree
zpe.thermalcorrener: 0.201782 hartree
zpe.thermalcorrenthalpy: 0.202726 hartree
zpe.thermalcorrgfe: 0.153907 hartree
zpe.sumelectzpe: -590.487906 hartree
zpe.sumelectthermal: -590.476859 hartree
zpe.sumelectthermalent: -590.475915 hartree
zpe.sumelectthermalfe: -590.524734 hartree
dipole: 3.5672 20.1948 -0.7947
dipole: 20.5228
quadrupole: -56.3648 34.2695 -60.9887
quadrupole: 22.8796 -3.7054 -8.3580
quadrupole: -28.6701 61.9641 -33.2940 22.8796 -3.7054 -8.3580
hfenergy: -590.6786407 hartree
pointgroup: C01 [X(C8H11B1F2N1)]
dipole: -1.0404226 2.3717154 -0.5791021 debye
dipolederiv: -0.082323 0.2328789 -0.0708664 0.141643 -0.0304032 -0.0375926 -0.0409472 -0.0507924 -0.0685378 0.1234038 -0.1927829 0.0248484 0.0513247 0.0558326 -0.0465408 -0.0452703 -0.0126362 -0.0720461 -1.038792 0.0537981 0.1082898 0.1163423 -0.2833567 0.0161572 0.1010272 0.0256463 -0.2104053 0.4984338 0.3094885 -0.1879334 -0.0652376 0.5230879 -0.1862258 -0.0811984 -0.2517187 0.000915 -0.3464388 -0.1408082 0.0811096 -0.1406899 -0.0945508 0.0221043 0.080308 0.0237206 -0.1163801 0.1995929 -0.0111947 -0.0414213 0.0648916 0.0817108 -0.0616223 -0.0715153 -0.0488985 -0.0596502 0.0642039 -0.0452872 0.0279362 -0.0509349 0.033185 0.0443781 0.0297911 0.04346 0.1401623 0.0818405 0.0456754 -0.0034888 0.0306159 0.0326153 0.0274415 -0.0026596 0.0273514 0.1332509 0.1163144 0.04556 -0.0056563 0.0347814 -0.0084617 0.0440347 -0.0066951 0.0460693 0.1420773 -0.0018157 0.0074393 0.0215577 0.0189724 0.0985268 0.0127986 0.021683 0.0139533 0.1424747 -0.271397 0.0550996 -0.023768 -0.0404509 -0.5037679 0.0632945 0.0077882 0.0575095 -0.3372479 2.6206975 -0.2201252 -0.2093399 -0.2599742 1.8550975 -0.2727387 -0.1982158 -0.273997 0.873133 0.1144278 -0.1118395 0.1385023 -0.0363791 0.0653167 -0.1159499 0.004721 -0.1777763 0.4507429 0.004282 0.0508461 0.0059984 0.0288198 0.1165382 0.0009571 0.0780597 -0.026863 0.0533905 0.0430001 -0.0642826 -0.0000694 -0.067442 0.034062 0.0543423 -0.0212884 0.0376435 0.059485 0.1014033 0.0241783 -0.0161505 0.0130639 0.0041619 -0.0405912 -0.0210972 -0.0191329 0.0516518 0.1017442 -0.0664975 -0.015455 0.0424145 0.3400558 0.1995335 0.0674971 0.285079 0.187538 0.0679224 -0.0623399 0.0466484 -0.0497329 0.0090596 0.0000594 0.0617567 0.0233878 0.0588472 -0.0188076 0.0295666 -0.0049848 -0.0226046 0.1068685 -0.030687 -0.0505107 -0.0178907 0.0889977 0.1073351 0.0349073 -0.0267938 0.0392214 0.0468748 0.0371978 -0.0240037 0.0066904 0.0123809 0.4108068 -0.1452236 0.0071328 -0.078476 0.2812104 -0.0333147 -0.0150901 -0.0235131 0.149029 -1.0464693 -0.2101082 0.1700617 -0.2748768 -0.8230721 0.195169 0.1874803 0.1859938 -0.3654353 -0.8493654 0.3810513 -0.0261576 0.5047081 -0.9405914 0.1077948 -0.0616205 0.1267138 -0.3143734 unknown
polarizability: 134.8319897|1.9371437|133.0430369|-9.3080473|-16.5790445|85.0102411 unknown
InChI: InChI=1/C8H11BF2N/c1-12(2)8-6-4-3-5-7(8)9(10)11/h3-6,12H,1-2H3
charge 1 multiplicity 1
23 atoms
C  -0.69987937 1.16123094 0.98579393
C  0.6707109 1.04648553 0.80721992
C  1.44522228 2.12862915 0.36562735
C  0.77114114 3.32966048 0.1123153
C  -0.59322377 3.46394656 0.28671448
C  -1.33017226 2.37014511 0.72654715
H  -1.27484371 0.30967262 1.32709472
H  1.15875624 0.1012751 1.01244588
H  -1.09722267 4.40149654 0.08575887
H  -2.40009054 2.47014582 0.86228645
N  1.52695656 4.50924001 -0.37314948
B  2.97114458 1.9028435 0.20643267
C  1.12276875 4.91313699 -1.75857815
H  0.12029871 5.33352624 -1.72891404
H  1.83222878 5.65595213 -2.11901653
H  1.14206268 4.02785901 -2.39049854
C  1.48596431 5.65338863 0.59258265
H  2.11993458 6.45051828 0.20882806
H  0.46053994 6.00247926 0.68791842
H  1.85604844 5.30080222 1.55311499
H  2.50706113 4.22423557 -0.43500107
F  3.78588997 2.89546902 -0.1898885
F  3.53571736 0.74213713 0.45162264
