program: Gaussian 16
title: MeQMeBF2-H+
version: ES64L-G16RevC.01
method: RwB97XD
basis: GenECP
operation: Freq
keyword: #N
keyword: Geom=AllCheck
keyword: Guess=TCheck
keyword: SCRF=Check
keyword: GenChk
keyword: RwB97XD/GenECPFreq
converged: YES YES YES YES
title: Mulliken charges:
elementType: C C N N N B H C H H H F F C H H H
charge: 0.182426 -0.452856 0.288554 0.050585 -0.199775 0.285337 0.476730 -0.377171 0.245431 0.227621 0.255324 0.048804 0.046653 -0.757253 0.231964 0.230739 0.216887
chargesum: 1.00000
title: Mulliken charges with hydrogens summed into heavy atoms:
elementType: C C N N N B C F F C
charge: 0.182426 -0.452856 0.288554 0.050585 0.276955 0.285337 0.351205 0.048804 0.046653 -0.077663
1716.lowfreq: -13.2695 0.0005 0.0011 0.0011 37.2494 47.1664 67.7896 89.9933 102.2283
frequency: 64.2206 84.6138 99.7339 130.9464 161.0286 273.6096 289.2570 302.8975 333.9362 355.6604 523.2603 595.2192 614.0620 693.4612 704.3501 739.6894 767.9964 835.8532 997.8723 1061.9445 1083.5984 1102.2474 1161.5106 1208.7635 1259.8041 1304.7740 1374.6868 1416.0560 1425.8268 1439.3651 1455.2509 1467.0435 1474.6601 1491.2216 1499.2170 1521.4159 1554.9506 1662.3207 3070.9944 3093.4870 3142.8607 3186.0502 3186.8463 3213.6756 3639.1963
redmass: 1.0639 6.7892 2.1986 6.1775 1.5252 4.5415 3.1542 4.0916 3.8780 6.0005 3.8823 9.3337 8.0559 5.1788 6.5725 8.1157 4.5600 1.1204 2.0817 1.5454 2.8036 2.0455 1.3522 3.5045 3.8315 3.3437 4.5641 2.0846 2.3325 4.7513 1.6373 1.1494 1.0587 1.1296 1.7217 1.2645 2.9284 5.4452 1.0384 1.0325 1.1014 1.1036 1.1057 1.1067 1.0842
irintensity: 0.0352 0.4021 0.0455 2.6958 1.6040 6.9601 1.3213 10.8410 9.4644 3.2802 4.0933 19.1338 31.7975 15.6284 1.0889 31.3811 24.2319 100.2611 12.5844 3.8694 61.6468 83.5195 1.4751 75.9611 12.1911 281.2367 101.9060 173.8897 88.4392 149.6385 72.8119 68.3398 9.5024 45.4033 4.5982 19.7369 57.5065 89.5745 0.6692 0.9530 0.2325 0.3531 0.1188 1.0455 258.5770
temp: 298.150 k
press: 1.00000 atm
elementType: 6 6 7 7 7 5 1 6 1 1 1 9 9 6 1 1 1
symmnumber: 1
zpe: 341327.1 jmol-1
zpe.correction: 0.130005 hartree
zpe.thermalcorrener: 0.139729 hartree
zpe.thermalcorrenthalpy: 0.140673 hartree
zpe.thermalcorrgfe: 0.094215 hartree
zpe.sumelectzpe: -545.199211 hartree
zpe.sumelectthermal: -545.189486 hartree
zpe.sumelectthermalent: -545.188542 hartree
zpe.sumelectthermalfe: -545.235001 hartree
dipole: 11.3321 8.2537 2.2124
dipole: 14.1928
quadrupole: -22.7251 -28.0698 -46.1502
quadrupole: 14.1319 3.3162 8.4824
quadrupole: 9.5899 4.2453 -13.8352 14.1319 3.3162 8.4824
hfenergy: -545.3292158 hartree
pointgroup: C01 [X(C4H7B1F2N3)]
dipole: -1.0674906 1.5021817 -0.7809701 debye
dipolederiv: 0.1018568 -0.0942699 -0.1301319 -0.0587218 0.2738499 0.3349913 -0.0232475 0.1782102 0.4837744 -0.3028791 0.3165289 -0.0491989 0.23397 -0.4811985 -0.0175802 -0.2987187 0.3873637 -0.3842515 -0.0687695 0.0823297 0.0261657 0.0988384 -0.1996487 -0.0268276 0.1156824 -0.1845856 0.0087793 -0.0638915 -0.0539179 -0.2167688 -0.0503941 0.1188117 0.2230746 -0.2291893 0.2412944 -0.4708947 -0.0895705 0.1269445 0.2318625 0.1355463 -0.3824104 -0.2695487 0.2735968 -0.3349961 0.2526896 1.3614428 -0.768804 0.2765824 -0.7506728 2.0766249 -0.0472098 0.3507303 -0.1633183 1.9562126 0.3332845 -0.0213315 -0.0659321 -0.0170063 0.3929863 0.104736 -0.0571616 0.09859 0.3532531 0.2652631 -0.1808884 0.0299936 -0.1685119 0.4216106 -0.0784415 0.0052806 -0.0362822 0.1021845 0.1231933 0.0322915 0.0051081 0.0115963 0.0825746 -0.0598199 -0.033142 -0.0007226 0.0473367 0.0729197 0.0292789 0.0374532 -0.0043001 0.0322659 0.0614559 0.0739961 0.0264207 0.0572055 0.0006988 -0.0253602 -0.0370542 0.0236375 0.0321251 0.0000995 -0.0345835 -0.0320279 0.1220139 -0.4198576 0.1322725 -0.1953864 0.1154699 -0.4776467 0.0285374 -0.2559724 0.1223041 -1.108473 -0.51952 0.3843885 0.0484041 0.3972693 -1.0332547 -0.1674544 0.0840122 -0.2286201 -0.5342223 0.010565 0.0582247 0.0512553 0.0387297 -0.0519131 -0.0960239 0.0062823 -0.0452804 -0.0748497 -0.0119833 -0.0079383 0.01063 -0.0101229 0.1124681 -0.0356237 -0.008491 -0.0485315 0.0655563 0.0923252 0.0351624 -0.043903 0.047181 0.0746435 0.0426907 -0.010885 -0.0032915 0.0749119 0.1149223 -0.0449115 0.0209204 -0.0425084 0.0081116 0.0029445 0.0418107 0.0234733 0.0487734 unknown
polarizability: 66.3370643|-21.2741183|87.7982203|6.2691635|1.8601658|88.2958048 unknown
InChI: InChI=1/C4H7BF2N3/c1-3-4(5(6)7)8-9-10(3)2/h8H,1-2H3
charge 1 multiplicity 1
17 atoms
C  2.56580539 1.62483409 1.19509129
C  3.20072757 0.46123066 0.80965683
N  2.02124661 2.11982826 0.04836848
N  2.26818779 1.37125806 -0.99533187
N  2.9681297 0.38808515 -0.53042467
B  4.00915745 -0.60960342 1.59752887
H  3.27986778 -0.32853928 -1.17624129
C  1.24436349 3.34809991 -0.10970288
H  0.87371551 3.37382578 -1.13090062
H  0.4126704 3.3324786 0.59262738
H  1.88890373 4.20536544 0.07961444
F  4.2153446 -0.47311089 2.88544217
F  4.48033723 -1.65431938 0.95140253
C  2.42198767 2.2889601 2.51295506
H  1.37139938 2.32004723 2.8105291
H  2.98111952 1.74422776 3.27054747
H  2.79791473 3.31323204 2.46998193
