program: Gaussian 16
title: f_nmeimidazole_prot
version: AS64L-G16RevC.02
method: RwB97XD
basis: GenECP
operation: Freq
keyword: #N
keyword: Geom=AllCheck
keyword: Guess=TCheck
keyword: SCRF=Check
keyword: GenChk
keyword: RwB97XD/GenECPFreq
converged: YES YES YES YES
title: Mulliken charges:
elementType: C C H C N N B H H H H C H F F
charge: -0.395651 -0.021065 0.291133 -0.503445 0.010322 -0.205180 0.311630 0.448360 0.240685 0.187349 0.244397 0.013051 0.315219 0.039874 0.023321
chargesum: 1.00000
title: Mulliken charges with hydrogens summed into heavy atoms:
elementType: C C C N N B C F F
charge: 0.276780 0.270068 -0.503445 0.010322 0.243180 0.311630 0.328270 0.039874 0.023321
1716.lowfreq: -49.5505 -28.0071 -20.5517 -0.0009 -0.0006 -0.0005 72.8002 95.7756 115.5438
frequency: 71.8708 94.4527 115.0637 180.7184 262.3674 316.9330 349.1211 466.6302 592.7960 600.7284 632.1103 699.5589 704.7992 719.2015 863.9564 892.3309 989.1884 1066.4826 1106.2217 1131.7827 1163.4473 1197.4107 1249.0392 1319.0512 1393.2061 1405.3262 1446.3588 1471.4333 1491.8011 1508.1913 1535.3446 1598.2870 1677.3428 3095.9621 3192.7902 3202.7224 3291.1109 3301.7903 3641.4646
redmass: 6.8006 5.8379 4.6045 1.0741 4.1498 6.1606 5.7362 4.4236 6.5900 10.8597 2.4057 2.5743 4.8227 1.5526 1.4934 1.4365 6.1535 4.3230 1.5076 2.0106 1.3332 1.2431 1.9985 2.6715 7.1565 4.9397 3.7260 1.2650 1.0599 2.6347 1.2413 4.0140 4.4552 1.0321 1.1079 1.1080 1.1049 1.1036 1.0854
irintensity: 0.5690 1.2152 0.6830 0.3263 4.7166 11.9811 8.0393 1.0525 31.0780 18.8449 54.9127 0.8942 15.2123 139.0244 0.4095 23.5698 43.6767 5.3841 13.6804 11.6728 0.0173 28.2950 202.2402 356.8931 232.6813 154.0523 134.5936 0.8752 21.0935 77.7890 58.7287 1.1017 114.0572 4.8856 0.3429 0.6857 45.1317 15.2109 236.6696
temp: 298.150 k
press: 1.00000 atm
elementType: 6 6 1 6 7 7 5 1 1 1 1 6 1 9 9
symmnumber: 1
zpe: 299296.1 jmol-1
zpe.correction: 0.113996 hartree
zpe.thermalcorrener: 0.122275 hartree
zpe.thermalcorrenthalpy: 0.123219 hartree
zpe.thermalcorrgfe: 0.080121 hartree
zpe.sumelectzpe: -489.899831 hartree
zpe.sumelectthermal: -489.891552 hartree
zpe.sumelectthermalent: -489.890608 hartree
zpe.sumelectthermalfe: -489.933706 hartree
dipole: 7.9278 2.3798 -0.4413
dipole: 8.2890
quadrupole: -28.2851 -35.6293 -47.6316
quadrupole: -0.9421 0.2460 -2.2515
quadrupole: 8.8969 1.5527 -10.4496 -0.9421 0.2460 -2.2515
hfenergy: -490.0138271 hartree
pointgroup: C01 [X(C4H6B1F2N2)]
dipole: 3.0021203 0.9786122 -0.1634265 debye
dipolederiv: 0.5917957 -0.1934015 0.0368592 -0.1922258 0.1942654 -0.0054304 0.038 -0.0034345 0.1850204 0.4223999 -0.0821967 0.0167758 0.1221442 0.0625569 -0.0099736 -0.0211489 -0.0101463 -0.0125873 0.1237306 0.0193036 -0.002954 -0.0042358 0.1589697 0.0049766 0.0015462 0.0062561 0.1874525 -0.9708358 0.0828196 -0.0183646 -0.1492439 -0.0004756 -0.0247474 0.0189739 -0.0229835 -0.1440516 -0.5582319 0.2073314 -0.036156 0.0439816 -0.2868183 0.0272121 -0.0065503 0.0263546 -0.1355736 -0.3004178 0.3003225 -0.051521 0.4307376 -0.3707759 0.0317851 -0.0700065 0.0298419 -0.2006578 2.7207906 0.0098925 0.0011183 0.1329563 1.8874235 -0.1664416 -0.0241955 -0.1674382 0.8614024 0.3168274 -0.0830545 0.0150684 -0.1036335 0.3933259 -0.0100911 0.0172766 -0.0132004 0.3479482 0.0265252 0.0009382 -0.0515937 0.04432 0.0543667 -0.0498267 -0.006765 -0.0678083 0.0469964 0.036154 0.0214513 -0.0037107 -0.0567103 -0.0156357 0.0271398 0.0073254 0.0262101 0.1234479 0.0195041 0.0240155 0.0448055 0.044811 0.0972303 0.0313732 -0.01048 0.0477359 0.0074881 0.2364069 -0.3830817 0.0655165 -0.3382157 0.3627063 -0.0349642 0.0593377 -0.0316006 0.1755398 0.1476716 0.0348594 -0.0071234 0.0493638 0.1918976 0.0008467 -0.008563 0.0001196 0.1976274 -0.7764294 -0.2951234 0.0468465 -0.4481134 -0.9592202 0.1049294 0.0735591 0.1060206 -0.3199622 -1.0358912 0.3359239 -0.0555668 0.4240638 -0.7698164 0.0732121 -0.0683098 0.0740729 -0.3200904 unknown
polarizability: 93.5332268|-1.744364|74.5954929|0.5846919|-5.1182301|45.5500651 unknown
InChI: InChI=1/C4H6BF2N2/c1-9-2-4(5(6)7)8-3-9/h2-3,8H,1H3
charge 1 multiplicity 1
15 atoms
C  3.22361674 -0.65142159 0.12449973
C  0.70793823 -0.84060243 0.13248936
H  0.71872711 -1.90276564 0.31470529
C  -0.34313924 0.01489404 -0.02056886
N  1.86547974 -0.1135471 0.01614372
N  0.22695092 1.25945454 -0.23071244
B  -1.86883514 -0.24532197 0.02446843
H  -0.28316238 2.11854899 -0.387403
H  3.3646363 -1.41852321 -0.6345145
H  3.93397005 0.15601976 -0.03664753
H  3.36278393 -1.07177765 1.1188119
C  1.54657397 1.16077135 -0.20442601
H  2.24685575 1.96929303 -0.33984837
F  -2.33187275 -1.45858674 0.22076102
F  -2.70275024 0.76434261 -0.13288174
