program: Gaussian 16
title: MePBF2 H+
version: ES64L-G16RevC.01
method: RwB97XD
basis: GenECP
operation: Freq
keyword: #N
keyword: Geom=AllCheck
keyword: Guess=TCheck
keyword: SCRF=Check
keyword: GenChk
keyword: RwB97XD/GenECPFreq
converged: YES YES YES YES
title: Mulliken charges:
elementType: C H H C C H H C N N B F F H H
charge: -0.990271 0.198655 0.197870 -0.048795 -0.023906 0.306747 0.297869 0.199268 -0.012677 -0.285354 0.381156 0.053204 0.074141 0.442746 0.209346
chargesum: 1.00000
title: Mulliken charges with hydrogens summed into heavy atoms:
elementType: C C C C N N B F F
charge: -0.384400 0.257953 0.273963 0.199268 0.430069 -0.285354 0.381156 0.053204 0.074141
1716.lowfreq: 0.0001 0.0005 0.0010 7.5924 32.2188 39.8428 113.2899 127.8508 132.5411
frequency: 111.8791 127.2392 132.2238 156.1708 307.7459 311.2375 353.9556 484.3974 584.8239 608.3212 611.0483 651.9427 705.7191 720.0856 856.8556 956.4561 1000.8306 1028.6824 1032.4835 1076.3858 1140.4788 1183.9213 1282.2646 1344.7720 1387.7588 1425.4701 1446.7810 1452.1665 1485.7064 1499.6810 1510.0924 1597.6883 1660.2052 3073.9985 3147.6441 3168.8805 3278.9750 3282.8790 3633.3244
redmass: 3.4629 1.6018 3.0477 4.5789 3.7620 3.8291 8.1085 5.5372 4.3432 4.6445 3.2106 2.7865 5.2294 1.7398 1.4308 1.2964 5.6054 1.5445 3.2222 1.5126 2.3004 1.4969 2.1892 1.8394 4.8215 1.5658 2.5961 3.3150 1.0445 5.4107 1.4514 2.4259 5.4628 1.0371 1.1025 1.1031 1.1022 1.1022 1.0862
irintensity: 0.1689 0.8571 0.4738 2.5357 6.4678 3.8158 12.2822 1.0998 15.9137 35.9448 50.3374 11.4349 8.0252 147.7296 30.1537 1.8119 86.4088 10.8665 25.0435 4.1193 14.8982 89.1946 231.2296 105.2140 175.4616 175.7623 287.5828 298.8561 17.1697 259.6136 174.0187 23.1037 10.9924 4.7862 2.6841 4.3492 18.4805 17.0046 300.4691
temp: 298.150 k
press: 1.00000 atm
elementType: 6 1 1 6 6 1 1 6 7 7 5 9 9 1 1
symmnumber: 1
zpe: 297996.8 jmol-1
zpe.correction: 0.113501 hartree
zpe.thermalcorrener: 0.121618 hartree
zpe.thermalcorrenthalpy: 0.122562 hartree
zpe.thermalcorrgfe: 0.080283 hartree
zpe.sumelectzpe: -489.885114 hartree
zpe.sumelectthermal: -489.876998 hartree
zpe.sumelectthermalent: -489.876054 hartree
zpe.sumelectthermalfe: -489.918332 hartree
dipole: 7.0172 33.5856 -17.1263
dipole: 38.3476
quadrupole: -28.0821 188.0017 24.5363
quadrupole: 49.0376 -24.1723 -123.6364
quadrupole: -89.5674 126.5164 -36.9490 49.0376 -24.1723 -123.6364
hfenergy: -489.9986154 hartree
pointgroup: C01 [X(C4H6B1F2N2)]
dipole: -1.6218281 -0.2087918 0.4862846 debye
dipolederiv: 0.0390876 -0.0232468 0.0624755 -0.026444 0.0594198 0.0506454 0.0331943 0.0156432 0.0450238 -0.0425177 -0.0031276 -0.0827973 -0.0240512 0.1059415 0.0055743 -0.0031666 0.0243923 0.0209268 0.0441346 0.0676211 0.0488395 0.0793687 0.0353873 -0.0244636 0.0369363 0.0218933 0.012977 0.2552279 0.0017516 0.006894 -0.2006342 0.1252164 -0.0832389 0.616428 -0.0740831 0.3731222 0.4651356 0.0181132 -0.0119312 0.2266676 0.0843313 -0.1304891 -0.6600265 -0.1443312 0.4262207 0.1751715 0.0029647 -0.011424 0.0025584 0.175518 0.0139171 -0.0146519 0.0140028 0.1355903 0.1504494 -0.0036345 0.0072665 -0.0102405 0.1771151 0.0128146 0.0283174 0.0108449 0.1461194 -0.7222732 0.0234869 -0.1168026 0.0880176 -0.0552162 -0.1812485 -0.2824453 -0.1777662 0.3648268 0.2876708 0.1151659 -0.3199394 0.1508917 -0.2092645 0.1823409 -0.4219456 0.1874976 -0.754514 -0.9022036 -0.3014021 0.853956 -0.3901324 -0.2448852 0.324792 1.1100465 0.3348046 -1.0393045 2.5369014 0.2335039 -0.5448049 0.2293862 1.1029912 -0.4810588 -0.5388893 -0.4872028 2.3888123 -1.2019854 -0.0670487 0.1123869 -0.0002593 -0.3173968 0.052849 -0.0888473 0.0463703 -0.4516447 -0.4820834 0.0289159 -0.1129473 -0.0353319 -0.3891067 0.2650925 0.0952725 0.2707395 -1.1323874 0.2945626 -0.0349401 0.1024162 -0.0274767 0.3716205 -0.0280196 0.0818363 -0.0276496 0.4529298 0.1027217 -0.0581235 0.0064119 -0.0623201 -0.0216719 0.0204927 0.0079413 -0.0151556 0.0113015 unknown
polarizability: 84.0438488|3.8916118|49.0669629|-8.0774332|-13.1852479|83.2201215 unknown
InChI: InChI=1/C4H6BF2N2/c1-4-2-8-9(3-4)5(6)7/h2-3,8H,1H3
charge 1 multiplicity 1
15 atoms
C  1.08577328 6.112422 -0.94528088
H  1.98095696 6.09955625 -0.32465217
H  0.35101037 6.76697028 -0.47482731
C  0.50504187 6.89784299 -3.34868558
C  2.65245173 6.8040586 -2.87874865
H  -0.57442804 6.87500549 -3.36131405
H  3.63671834 6.6944667 -2.45020603
C  1.40984708 6.58503831 -2.32418585
N  1.18490523 7.26940734 -4.42326129
N  2.51135837 7.22158925 -4.16425119
B  3.527592 7.57532694 -5.15459731
F  4.78174903 7.5090446 -4.81180637
F  3.1120097 7.94409791 -6.33890001
H  0.84249839 7.56241935 -5.32952155
H  0.67410513 5.10180483 -0.97203309
