program: Gaussian 16
title: f_quinoline_prot
version: AS64L-G16RevC.02
method: RwB97XD
basis: GenECP
operation: Freq
keyword: #N
keyword: Geom=AllCheck
keyword: Guess=TCheck
keyword: SCRF=Check
keyword: GenChk
keyword: RwB97XD/GenECPFreq
converged: YES YES YES YES
title: Mulliken charges:
elementType: C C C C C C H C H H C C H H H N B F F H
charge: 0.096599 -0.885337 -0.897748 0.389181 -0.200383 -0.529566 0.284800 1.376102 0.257873 0.276396 -1.040277 0.198547 0.318341 0.295340 0.322825 0.000566 0.348304 0.036084 -0.047076 0.399430
chargesum: 1.00000
title: Mulliken charges with hydrogens summed into heavy atoms:
elementType: C C C C C C C C C N B F F
charge: 0.381399 -0.885337 -0.897748 0.389181 0.057490 -0.253170 1.694442 -0.744937 0.521372 0.399996 0.348304 0.036084 -0.047076
1716.lowfreq: -20.4284 -0.0009 -0.0009 -0.0004 20.9449 27.3027 66.8002 105.8397 160.6828
frequency: 66.6421 105.7908 160.6051 179.9207 214.9359 303.6246 340.9181 393.9591 460.8350 477.0809 493.6898 529.7110 557.5661 582.2106 617.9082 681.6221 693.8048 788.1395 792.9988 826.3881 849.5066 864.7060 884.7861 997.2670 1004.9097 1007.2599 1037.0224 1052.2985 1086.1904 1119.5663 1169.4310 1187.3961 1248.9402 1259.2949 1264.4736 1303.0247 1362.8011 1370.6822 1410.3330 1422.4043 1469.8919 1515.1254 1530.2415 1630.1557 1662.0585 1664.5152 1716.8148 3212.0567 3214.2647 3216.9275 3235.8029 3248.7055 3259.8600 3576.7364
redmass: 14.2289 5.2000 8.9882 4.3613 4.1264 10.1495 9.6036 3.6864 5.1431 3.1044 3.6340 8.8870 7.0627 9.4593 3.3255 5.3235 7.0523 1.7268 2.1165 5.3370 1.3870 5.4830 1.4110 1.3357 1.6162 3.9469 1.3585 1.3493 2.7933 2.0131 1.6012 1.5892 2.5835 1.5169 1.5810 2.2127 3.8178 3.4210 2.9127 7.7544 1.6900 2.7756 2.3237 2.5427 4.4507 6.2857 4.5451 1.0901 1.0931 1.0930 1.0982 1.0933 1.0993 1.0797
irintensity: 0.0980 2.5307 6.1757 2.6749 0.8385 7.6163 1.3055 0.7692 1.0529 3.2344 44.0889 19.0418 14.7552 17.6299 7.3913 16.6899 1.2783 0.1752 115.8159 3.5747 85.4786 0.7109 0.1844 2.0249 11.5556 23.4424 0.3316 0.1664 8.4898 14.0785 28.8202 61.9528 119.6033 79.3462 24.5737 243.3985 450.1731 44.1861 50.6942 117.6975 3.4127 32.6064 33.4223 56.8668 1.5101 163.6652 171.9831 0.0102 0.1544 0.1259 0.3527 2.3514 8.7309 275.0275
temp: 298.150 k
press: 1.00000 atm
elementType: 6 6 6 6 6 6 1 6 1 1 6 6 1 1 1 7 5 9 9 1
symmnumber: 1
zpe: 396704.4 jmol-1
zpe.correction: 0.151097 hartree
zpe.thermalcorrener: 0.160761 hartree
zpe.thermalcorrenthalpy: 0.161705 hartree
zpe.thermalcorrgfe: 0.115448 hartree
zpe.sumelectzpe: -626.227845 hartree
zpe.sumelectthermal: -626.218180 hartree
zpe.sumelectthermalent: -626.217236 hartree
zpe.sumelectthermalfe: -626.263493 hartree
dipole: 6.6837 -1.2776 0.3778
dipole: 6.8152
quadrupole: -48.3009 -43.4517 -72.1802
quadrupole: -7.0415 0.8851 -2.1725
quadrupole: 6.3434 11.1926 -17.5359 -7.0415 0.8851 -2.1725
hfenergy: -626.3789415 hartree
pointgroup: C01 [X(C9H7B1F2N1)]
dipole: 2.5068053 -0.4571731 0.0124112 debye
dipolederiv: 0.3647643 -0.0233009 -0.0022023 0.3813439 0.1923667 -0.0208087 -0.0309444 -0.0141016 -0.0357603 -0.7706804 -0.1521017 0.0162431 -0.4371272 -0.6841727 0.0369616 0.0393263 0.0318805 -0.234054 0.5509761 -0.3937357 0.0253536 -0.0247491 0.0603098 0.0094909 -0.004046 0.011491 0.1673847 -0.6365981 0.4292794 -0.0284038 -0.1552293 -0.0954039 0.0098362 0.0123733 0.0045776 0.0391286 0.2273263 0.0346943 -0.0044091 -0.1281314 0.2345971 -0.0226856 0.0083069 -0.0226031 -0.0819387 -0.573007 0.0625911 -0.0007721 -0.0491852 0.185886 -0.0220639 0.00518 -0.0258234 -0.0950183 0.042277 0.0301599 -0.0025217 0.0284842 0.1039864 0.0005435 -0.0018042 0.0021688 0.134951 0.470103 -0.3303052 0.0232376 -0.080659 0.7276157 -0.0519101 0.0107887 -0.0508042 0.018422 0.0255791 -0.0518495 0.0048847 -0.0054715 0.0816787 0.0057763 0.0007293 0.0079527 0.151733 0.0965225 0.0131027 -0.0001499 0.0048557 0.0026778 0.0117969 0.0006469 0.0133048 0.1625231 0.0384419 -0.4121015 0.028501 -0.0494162 -0.8923662 0.0543706 0.0006202 0.0577404 -0.1494129 0.4724589 0.7340226 -0.0533316 0.0417091 0.3404824 -0.014257 -0.0045467 -0.0199129 0.1205451 0.0876542 -0.0199587 0.001143 -0.0569264 0.0749792 0.0063169 0.0048459 0.0052048 0.1402916 0.0833889 0.0193771 -0.0007923 0.0257913 0.0968394 0.0049404 -0.0007744 0.0039066 0.1754307 0.112089 -0.024685 0.0018608 -0.018355 0.1216004 0.0024732 0.0007963 0.0050144 0.1583659 -0.6081627 -0.3189619 0.0283006 0.0264304 -0.1677279 -0.0007418 0.0017582 0.0035578 -0.1598444 2.6417135 0.3286032 -0.0439023 0.4551142 1.9007691 -0.0850425 -0.0557718 -0.0897983 0.7922769 -1.3948574 0.0909688 0.003288 0.1795257 -0.4590016 0.0117576 -0.0027336 0.0104048 -0.2954662 -0.6740964 -0.1118138 0.0115523 -0.2484303 -1.1565162 0.0670259 0.0242742 0.0673774 -0.3055718 0.4441074 0.096015 -0.0078797 0.1104261 0.3313999 -0.0037806 -0.009025 -0.0015382 0.2960138 unknown
polarizability: 166.9919309|-18.8621797|166.6172512|0.8243766|-7.6221311|64.0440932 unknown
InChI: InChI=1/C9H7BF2N/c11-10(12)8-5-1-3-7-4-2-6-13-9(7)8/h1-6,13H
charge 1 multiplicity 1
20 atoms
C  -1.04652103 1.74507464 -0.05613537
C  -0.92784603 0.37118292 0.04740146
C  0.38748936 -0.16325932 0.07822571
C  1.52416708 0.67397878 0.01003131
C  1.33357739 2.07579762 -0.09536164
C  0.07241541 2.59917645 -0.12912427
H  -2.03810368 2.18222838 -0.08219459
C  2.80668724 0.08846349 0.04987399
H  2.20525773 2.71759196 -0.14859673
H  -0.07532141 3.6683467 -0.21024269
C  2.95818126 -1.27525345 0.14905935
C  1.81839562 -2.06587995 0.21001449
H  3.67881752 0.73090493 -0.000142
H  3.93207932 -1.74196299 0.1811334
H  1.85176972 -3.14446307 0.28711831
N  0.61104357 -1.51273869 0.17449878
B  -2.21984642 -0.48400743 0.12491142
F  -3.41478313 0.06451097 0.09325902
F  -2.16086292 -1.81640764 0.22683091
H  -0.2000736 -2.1226563 0.22199313
