program: Gaussian 16
title: h_benzopiperidine_prot
version: AS64L-G16RevC.02
method: RwB97XD
basis: GenECP
operation: Freq
keyword: #N
keyword: Geom=AllCheck
keyword: Guess=TCheck
keyword: SCRF=Check
keyword: GenChk
keyword: RwB97XD/GenECPFreq
converged: YES YES YES YES
title: Mulliken charges:
elementType: H C C C C H C H H B C N C C C H H C H H C H H H H H H H H H
charge: 0.253250 -0.397907 -0.116698 -0.385213 0.312576 0.295521 -0.069758 0.287510 0.233153 -0.251998 -0.132503 0.253646 -0.261720 -0.290595 -0.416306 0.273314 0.231530 -0.414595 0.266544 0.241894 -0.513674 0.254703 0.212781 0.254834 0.210781 0.255739 0.176493 0.000916 0.050479 0.185305
chargesum: 1.00000
title: Mulliken charges with hydrogens summed into heavy atoms:
elementType: C C C C C B C N C C C C C
charge: -0.144657 0.178823 -0.097703 0.312576 0.163395 -0.200602 -0.132503 0.438951 0.243124 0.217842 0.051178 0.051019 -0.081442
1716.lowfreq: -33.5381 -20.3360 -12.3651 -0.0003 -0.0003 -0.0003 61.8687 95.5227 97.0493
frequency: 59.9358 95.0633 96.7540 164.5479 231.5904 255.0448 263.7335 293.7781 346.7302 367.3680 393.8020 446.7768 468.9672 486.4215 505.4771 554.6619 557.1000 645.2337 754.3922 778.7206 795.4434 810.4277 815.4568 849.1260 866.2827 892.5914 907.6989 920.7637 925.5057 970.9703 995.2240 1017.6332 1031.2987 1049.8283 1052.0988 1052.9381 1078.5943 1104.2905 1119.3472 1156.1096 1179.4384 1201.5775 1202.9964 1227.3797 1241.9839 1282.4136 1304.3017 1309.9844 1315.5462 1337.1439 1349.4838 1361.8838 1397.9097 1402.6909 1403.8339 1416.1086 1451.3532 1459.6724 1490.5352 1493.9737 1503.4373 1505.8033 1517.3273 1521.2052 1543.7503 1638.8923 1685.4150 2546.9277 2675.1781 3052.8340 3061.1872 3067.0039 3094.9558 3099.2551 3126.0264 3126.3126 3129.5642 3157.4833 3163.8048 3203.5116 3207.8634 3217.4709 3229.7946 3416.2526
redmass: 3.1132 3.3990 3.1126 3.1062 2.1658 2.3531 3.7846 1.7609 1.5901 1.8662 2.1821 3.1891 3.0502 3.2641 2.1356 2.9871 3.1314 4.5160 3.0894 2.6481 1.4174 3.5336 1.4754 2.0154 2.0617 1.5099 1.4152 2.8680 1.7848 1.4833 1.4412 1.4171 2.6655 1.3468 2.3360 2.0780 2.1744 1.8477 2.4162 1.0988 2.2462 1.1414 1.5306 2.2651 1.4733 1.3275 1.6560 1.2065 1.7622 1.9699 1.6665 1.2701 1.4142 1.4208 1.3617 1.4770 1.2979 1.1982 1.1914 1.6137 1.0846 1.3067 1.1519 1.1953 1.6881 5.3683 5.3330 1.0689 1.1138 1.0707 1.0654 1.0647 1.0605 1.0615 1.0948 1.0971 1.1013 1.1100 1.1096 1.0887 1.0914 1.0949 1.0990 1.0758
irintensity: 0.4490 0.1468 0.6547 0.2898 1.7926 1.5720 0.4931 1.9358 4.5691 5.1079 0.6259 2.8129 0.9793 6.9598 2.4198 6.5370 14.3797 1.0423 15.8511 6.7881 45.6678 6.6917 10.4069 14.9486 25.2065 3.8082 1.2168 6.1031 7.6457 0.2109 33.0245 5.1603 22.1416 0.0905 15.9454 8.7368 0.5899 3.0613 5.4691 1.1237 17.3270 1.2189 16.6934 10.7340 6.1538 15.4274 154.8829 5.6954 23.2847 15.8839 6.1034 1.0949 1.9486 1.2311 1.0423 4.3310 66.0207 42.1394 29.4197 9.3083 11.5311 7.7899 17.6662 5.4987 49.0739 25.0644 118.2992 167.6492 148.1625 4.8522 22.1242 21.8917 2.4825 7.7767 11.4594 12.2583 19.7756 5.2396 6.1008 2.0395 0.6127 2.9172 2.8179 136.2764
temp: 298.150 k
press: 1.00000 atm
elementType: 1 6 6 6 6 1 6 1 1 5 6 7 6 6 6 1 1 6 1 1 6 1 1 1 1 1 1 1 1 1
symmnumber: 1
zpe: 702801.3 jmol-1
zpe.correction: 0.267683 hartree
zpe.thermalcorrener: 0.279124 hartree
zpe.thermalcorrenthalpy: 0.280068 hartree
zpe.thermalcorrgfe: 0.230607 hartree
zpe.sumelectzpe: -508.516246 hartree
zpe.sumelectthermal: -508.504805 hartree
zpe.sumelectthermalent: -508.503861 hartree
zpe.sumelectthermalfe: -508.553322 hartree
dipole: -1.7479 -0.9995 0.7475
dipole: 2.1478
quadrupole: -47.6335 -68.5675 -72.1555
quadrupole: -1.2254 0.4147 -1.8040
quadrupole: 15.1520 -5.7820 -9.3700 -1.2254 0.4147 -1.8040
hfenergy: -508.7839289 hartree
pointgroup: C01 [X(C11H17B1N1)]
dipole: -0.7231383 -0.3643097 0.1478897 debye
polarizability: 191.7742167|-4.5766364|162.2203476|1.8986886|-20.9202806|120.8142724 unknown
InChI: InChI=1/C11H17BN/c12-10-6-2-3-7-11(10)13-8-4-1-5-9-13/h2-3,6-7,13H,1,4-5,8-9,12H2
charge 1 multiplicity 1
30 atoms
H  4.64657342 -0.64158652 0.34203554
C  3.57800949 -0.4802461 0.27191992
C  3.0834335 0.71117216 -0.23922126
C  2.69575269 -1.46539463 0.69419269
C  1.70320143 0.95540644 -0.34561378
H  3.77229855 1.48092835 -0.56775613
C  1.32018422 -1.26679854 0.60630353
H  3.07141616 -2.39853865 1.09621222
H  0.64426161 -2.04537242 0.93836216
B  1.22134096 2.30869944 -0.91198127
C  0.85250245 -0.07397566 0.09190439
N  -0.60225877 0.13593139 -0.00299558
C  -1.28991834 -0.85154133 -0.91514809
C  -1.27890602 0.22124399 1.34501421
C  -2.74967759 -0.46871441 -1.09374296
H  -0.73720063 -0.84878414 -1.85481046
H  -1.18578104 -1.83299021 -0.45122593
C  -2.73650107 0.61471437 1.17083014
H  -0.71615749 0.94701905 1.93136372
H  -1.17972062 -0.761275 1.81031534
C  -3.46982897 -0.35812841 0.24905407
H  -3.21627883 -1.22314941 -1.72960344
H  -2.81227229 0.48138021 -1.63601496
H  -3.19513758 0.64153234 2.16105285
H  -2.79395053 1.63397678 0.77056702
H  -4.49729422 -0.02539778 0.09535302
H  -3.51989483 -1.3447826 0.72259973
H  2.01784848 3.12200588 -1.25312467
H  0.0562587 2.58137086 -1.02020355
H  -0.71321685 1.05828156 -0.43801847
