program: Gaussian 16
title: h_biphenylene_prot
version: AS64L-G16RevC.02
method: RwB97XD
basis: GenECP
operation: Freq
keyword: #N
keyword: Geom=AllCheck
keyword: Guess=TCheck
keyword: SCRF=Check
keyword: GenChk
keyword: RwB97XD/GenECPFreq
converged: YES YES YES YES
title: Mulliken charges:
elementType: C C C C C C C H C H H C H C H C C H B N C H H H C H H H H H H
charge: 0.200116 0.101253 -0.450025 -0.111975 -0.271420 -0.086071 -0.168149 0.234237 -0.488815 0.278609 0.204158 -0.398220 0.244044 -0.330731 0.260049 0.148438 0.342366 0.287293 -0.316831 0.284725 -0.371384 0.251619 0.228586 0.242277 -0.353741 0.228911 0.233022 0.256013 0.027852 0.032752 0.261043
chargesum: 1.00000
title: Mulliken charges with hydrogens summed into heavy atoms:
elementType: C C C C C C C C C C C C B N C C
charge: 0.200116 0.101253 -0.450025 -0.111975 -0.037184 -0.086071 0.110460 -0.284657 -0.154177 -0.070682 0.435730 0.342366 -0.256226 0.545768 0.351098 0.364205
1716.lowfreq: -0.0004 -0.0003 -0.0003 9.8465 12.9521 26.8765 74.2134 100.2287 118.2881
frequency: 73.4180 99.9316 118.1753 136.7566 154.7523 196.3557 243.8839 271.7378 277.9005 299.4465 316.3165 321.2231 338.5984 364.0658 407.0786 466.2288 474.4033 481.3547 550.3280 556.6701 592.6328 627.5474 645.5001 664.6926 739.1689 742.1877 787.6394 803.0181 813.1045 832.0666 848.6025 915.0895 942.9071 965.8918 966.2817 993.8304 1005.8154 1014.0429 1022.8050 1026.4382 1060.3205 1077.2428 1086.1360 1145.6704 1155.8255 1173.3961 1192.3666 1195.4621 1199.1920 1212.4733 1251.9805 1278.9136 1286.0478 1303.5791 1325.1599 1408.9807 1429.8847 1452.7738 1465.7113 1482.9865 1491.1248 1498.8571 1501.9267 1506.3394 1511.4529 1515.6675 1531.2471 1535.1269 1650.1822 1670.1030 1699.2615 1746.7803 2520.0612 2655.0471 3093.8956 3097.6583 3198.1101 3198.7737 3201.4209 3204.0057 3207.0776 3210.5273 3212.3845 3220.3305 3224.1338 3232.8276 3391.6811
redmass: 3.6940 3.7650 3.7034 3.0702 3.4538 3.4060 2.8618 1.0741 2.1130 1.5358 1.4051 1.8207 3.1462 4.2955 4.5619 3.8538 3.7530 3.0075 4.4196 3.4485 5.3557 5.5268 4.4915 3.6992 5.5226 3.8139 1.6023 1.3872 5.2797 3.3973 1.6128 3.4039 1.3503 1.3830 3.5559 1.4772 6.9085 1.3182 1.3590 2.2878 2.5204 1.8962 1.1638 1.8286 2.6357 1.7512 1.8443 1.9839 1.4729 1.4806 1.7697 1.7561 2.2685 1.9398 2.3780 2.2536 1.9149 1.1473 1.1911 1.5428 1.0957 1.1308 2.4504 1.1117 1.0628 2.0242 2.0054 1.6275 8.7764 6.8443 7.7829 8.6920 1.0699 1.1092 1.0310 1.0307 1.0883 1.1082 1.1078 1.1079 1.0915 1.1067 1.0933 1.0940 1.0970 1.0970 1.0792
irintensity: 4.3293 1.1581 9.2117 3.2431 0.4568 0.3499 0.4734 0.0288 0.9765 0.4796 0.6489 0.7299 3.9825 2.0862 3.6954 0.2907 0.4284 3.8083 10.6540 5.9966 2.0666 0.5588 6.7903 3.6248 5.7925 24.0871 0.0494 108.4251 7.9296 0.6711 36.2956 22.4984 1.9801 1.6801 24.9009 41.6085 22.6836 0.4673 0.0732 21.1665 2.3430 18.5523 0.9212 30.4753 23.5991 32.2634 2.6434 1.0391 7.2100 8.9182 8.4783 4.1643 104.5044 52.4608 128.6243 10.4534 78.1959 0.8569 8.9807 15.1716 1.0993 3.3703 12.9596 18.2281 33.1188 6.4494 17.5359 42.0670 67.6322 74.2640 24.0346 12.1313 292.7286 209.5497 3.0675 1.4846 0.8946 2.2293 0.1254 1.1071 2.2690 0.4354 6.1199 1.6849 8.0431 1.7669 211.6164
temp: 298.150 k
press: 1.00000 atm
elementType: 6 6 6 6 6 6 6 1 6 1 1 6 1 6 1 6 6 1 5 7 6 1 1 1 6 1 1 1 1 1 1
symmnumber: 1
zpe: 681919.2 jmol-1
zpe.correction: 0.259729 hartree
zpe.thermalcorrener: 0.273237 hartree
zpe.thermalcorrenthalpy: 0.274181 hartree
zpe.thermalcorrgfe: 0.220595 hartree
zpe.sumelectzpe: -621.532803 hartree
zpe.sumelectthermal: -621.519295 hartree
zpe.sumelectthermalent: -621.518351 hartree
zpe.sumelectthermalfe: -621.571937 hartree
dipole: -7.1009 -2.4366 0.0421
dipole: 7.5074
quadrupole: -45.2572 -69.6177 -91.4392
quadrupole: 11.4074 -0.7115 0.4733
quadrupole: 23.5142 -0.8463 -22.6678 11.4074 -0.7115 0.4733
hfenergy: -621.7925319 hartree
pointgroup: C01 [X(C14H15B1N1)]
dipole: -2.8293297 -0.9820004 0.0513628 debye
polarizability: 286.8059407|-21.3769919|242.5536169|-5.8439158|5.5662923|111.9018352 unknown
InChI: InChI=1/C14H15BN/c1-16(2)12-8-4-6-10-9-5-3-7-11(15)13(9)14(10)12/h3-8,16H,15H2,1-2H3
charge 1 multiplicity 1
31 atoms
C  1.19048696 -0.2613881 -0.06938472
C  1.77121114 1.02201317 -0.03450045
C  0.4002222 1.64969205 0.02977057
C  -0.18019368 0.35779281 -0.00622198
C  -0.34937727 2.78750978 0.09607882
C  -1.52972891 0.19843067 0.02353853
C  -1.75392464 2.60421977 0.12891683
H  0.0786681 3.78111896 0.12390217
C  -2.3369772 1.35344829 0.09484298
H  -2.39715143 3.47406089 0.18202889
H  -3.41700165 1.27143635 0.12238403
C  3.12740026 1.19838853 -0.06792842
H  3.6020588 2.17150152 -0.04321166
C  3.90115874 0.01509299 -0.13822211
H  4.98115742 0.09793244 -0.16771246
C  3.32090838 -1.23897277 -0.17119087
C  1.90665166 -1.43887116 -0.13828612
H  3.96220852 -2.11196496 -0.22504057
B  1.2567876 -2.82672597 -0.17585524
N  -2.12730849 -1.14692205 -0.00923152
C  -2.79936771 -1.50134892 1.28128944
H  -3.6433458 -0.83021349 1.42835825
H  -3.14276013 -2.53270336 1.21987882
H  -2.07863284 -1.38244902 2.08763005
C  -3.02714979 -1.35327418 -1.18718252
H  -3.32249492 -2.4004517 -1.21336071
H  -3.90422053 -0.71986323 -1.07379878
H  -2.48005815 -1.08408523 -2.08803321
H  1.89892622 -3.82775751 -0.23184066
H  0.05624726 -2.9295755 -0.14861501
H  -1.34141909 -1.79769805 -0.12127539
