program: Gaussian 16
title: Me_H-H+
version: ES64L-G16RevC.01
method: RwB97XD
basis: GenECP
operation: Freq
keyword: #N
keyword: Geom=AllCheck
keyword: Guess=TCheck
keyword: SCRF=Check
keyword: GenChk
keyword: RwB97XD/GenECPFreq
converged: YES YES YES YES
title: Mulliken charges:
elementType: C C C C C C H H H H N B C H H H C H H H H H H
charge: -0.282485 -0.146479 0.228437 -0.094939 -0.155350 -0.409572 0.256482 0.295055 0.221198 0.278136 0.061684 -0.259054 -0.382180 0.221130 0.232122 0.241230 -0.377630 0.223595 0.234303 0.225573 0.338526 0.021670 0.028545
chargesum: 1.00000
title: Mulliken charges with hydrogens summed into heavy atoms:
elementType: C C C C C C N B C C
charge: -0.026003 0.148576 0.228437 -0.094939 0.065849 -0.131436 0.400210 -0.208839 0.312303 0.305841
1716.lowfreq: -42.7453 -0.0007 -0.0004 0.0002 26.5956 42.2010 105.0687 132.5282 178.5005
frequency: 95.7797 131.8620 178.0498 205.7826 259.6933 299.0308 312.2651 340.8554 367.7795 395.6792 449.4896 506.0141 527.0712 568.2044 613.3767 746.8095 755.0108 803.3790 826.3772 864.4590 917.2836 939.0765 995.0759 1019.0499 1028.1462 1052.3924 1076.7511 1078.5130 1114.7717 1165.6533 1193.9665 1202.8260 1204.0366 1233.6029 1282.7639 1304.5637 1315.2396 1345.0056 1433.8591 1448.8757 1460.3605 1489.2999 1494.5523 1498.3093 1503.5329 1524.9522 1527.3300 1539.0217 1639.9898 1684.7731 2546.6698 2679.0783 3094.5217 3099.1031 3196.5547 3200.2183 3207.8981 3208.4126 3212.2556 3216.3884 3223.5028 3233.1531 3428.3197
redmass: 2.7953 3.0802 2.8552 1.3482 1.8314 2.3314 1.5927 1.0819 1.9318 2.4228 3.2697 3.4311 4.2231 3.0488 4.2390 3.7334 3.4110 1.3200 4.2287 1.4902 1.3147 3.0810 1.4271 1.4891 2.0712 1.3403 2.3509 1.1558 2.8122 1.5826 1.8538 1.3824 1.2461 1.5511 1.7532 1.6400 1.7635 3.6938 1.3668 1.1850 1.1507 1.3462 1.1672 1.1972 1.2666 1.3083 1.0581 1.6282 5.2708 5.7454 1.0693 1.1129 1.0315 1.0320 1.1079 1.1079 1.1071 1.0904 1.1023 1.0949 1.0947 1.0992 1.0771
irintensity: 0.0646 1.4488 0.8663 1.8871 3.1530 3.9273 0.4810 0.9318 3.4735 0.5856 2.5566 4.4516 4.8541 17.8043 1.8202 4.7220 16.6805 59.4147 7.2791 30.9012 1.0899 8.7625 26.3617 11.0277 17.0221 0.1631 0.6998 3.7359 6.6978 28.6050 3.9097 15.3882 9.5901 32.8952 9.1981 126.8789 50.4921 6.0025 38.3187 5.3862 5.4962 14.4310 25.6775 6.8978 3.1195 29.2585 22.9325 53.7789 18.5983 110.6868 176.1444 133.5463 2.7262 2.9097 0.4628 1.9271 1.9322 0.4477 0.3781 1.7894 3.2709 1.1245 166.5380
temp: 298.150 k
press: 1.00000 atm
elementType: 6 6 6 6 6 6 1 1 1 1 7 5 6 1 1 1 6 1 1 1 1 1 1
symmnumber: 1
zpe: 529387.1 jmol-1
zpe.correction: 0.201633 hartree
zpe.thermalcorrener: 0.211269 hartree
zpe.thermalcorrenthalpy: 0.212213 hartree
zpe.thermalcorrgfe: 0.167588 hartree
zpe.sumelectzpe: -391.837353 hartree
zpe.sumelectthermal: -391.827717 hartree
zpe.sumelectthermalent: -391.826773 hartree
zpe.sumelectthermalfe: -391.871398 hartree
dipole: 4.6586 19.9052 -0.8828
dipole: 20.4621
quadrupole: -42.5272 40.8497 -54.0161
quadrupole: 24.8978 -3.4248 -8.9861
quadrupole: -23.9627 59.4143 -35.4516 24.8978 -3.4248 -8.9861
hfenergy: -392.0389856 hartree
pointgroup: C01 [X(C8H13B1N1)]
dipole: 0.3699527 1.8144865 -0.5893319 debye
dipolederiv: -0.1336674 0.2657614 -0.0809096 0.1682619 -0.0539558 -0.0363073 -0.0534483 -0.0467152 -0.0795154 0.2064105 -0.2228237 0.0361195 0.116464 0.0723639 -0.0618054 -0.0748221 -0.0220621 -0.0607345 -1.307237 0.0649802 0.1176068 0.0904976 -0.2662926 0.0298993 0.1038644 0.030643 -0.1514399 0.5912492 0.3300214 -0.1735256 -0.127559 0.5277229 -0.1394176 -0.0194773 -0.1977265 -0.0262186 -0.4371917 -0.1669304 0.0928593 -0.1793959 -0.1081052 0.0225079 0.0969609 0.013357 -0.1186401 0.2161536 -0.0050121 -0.032568 0.104681 0.1269818 -0.0766756 -0.0640322 -0.0637049 -0.0531022 0.0545071 -0.0495467 0.0278597 -0.0570303 0.0282383 0.047624 0.0303564 0.0462315 0.1385636 0.0696254 0.0582031 -0.0101053 0.035417 0.0169541 0.0352171 -0.0019892 0.0304693 0.1299516 0.1190621 0.0336582 -0.0081996 0.0342284 -0.0052215 0.0468969 -0.0060695 0.0417309 0.1425947 -0.0122648 0.0055583 0.0154924 0.0165281 0.0983205 0.0136614 0.0140759 0.0164698 0.1413748 -0.2534325 0.0796426 -0.0370011 -0.0448668 -0.5458428 0.0790903 -0.0183781 0.0373219 -0.3099747 1.427835 -0.0410644 -0.1113284 -0.104424 0.5979089 -0.0599556 -0.0951616 -0.0583245 0.4240964 0.1199956 -0.1098668 0.1219323 -0.0317049 0.1033404 -0.1448027 0.0071122 -0.1985165 0.4214047 0.0064135 0.0562222 0.0082096 0.0266428 0.1120164 0.0029061 0.0779321 -0.0217013 0.0486185 0.0352962 -0.0681143 0.0014732 -0.0614053 0.0345757 0.0532885 -0.0257504 0.0352561 0.0657926 0.0971008 0.0229948 -0.0158169 0.0171322 0.0062439 -0.0552837 -0.0238595 -0.0187436 0.0505368 0.1131824 -0.0443634 -0.007487 0.0509164 0.3121039 0.2023261 0.0747588 0.3021572 0.2063208 0.0636712 -0.0689174 0.0416524 -0.0542075 0.0033119 -0.0021626 0.0573869 0.0172817 0.0590527 -0.0285281 0.0464174 -0.0019429 -0.0149319 0.0976842 -0.0284323 -0.0514031 -0.0119253 0.0911223 0.0986619 0.0282956 -0.0319703 0.0475326 0.0442024 0.0400229 -0.0159832 0.0102208 0.0192985 0.3129925 -0.1619283 0.016053 -0.0524941 0.326158 -0.0572839 -0.0191119 -0.0428197 0.1458998 -0.1500955 0.0085519 -0.000144 0.1364844 -0.2302294 0.0164095 -0.0395952 0.0334753 -0.1330106 -0.2097398 -0.0617394 0.0317406 -0.1167668 -0.2984797 0.0722768 0.046634 0.0676252 -0.1519917 unknown
polarizability: 146.9630841|1.5467559|135.0245269|-7.8606294|-17.7379223|85.9663643 unknown
InChI: InChI=1/C8H13BN/c1-10(2)8-6-4-3-5-7(8)9/h3-6,10H,9H2,1-2H3
charge 1 multiplicity 1
23 atoms
C  -0.72558298 1.14363929 0.92867678
C  0.6520386 1.03970997 0.79970102
C  1.43851041 2.11911017 0.36101712
C  0.75090807 3.30679624 0.06413439
C  -0.61791172 3.43755467 0.18321575
C  -1.35726582 2.34039776 0.61844503
H  -1.30628114 0.29590819 1.2703418
H  1.14538942 0.10554143 1.04201659
H  -1.12580761 4.36602622 -0.05116667
H  -2.43241258 2.43094763 0.71513589
N  1.53959907 4.47851338 -0.37690986
B  2.96708998 1.93235665 0.23722418
C  1.13863953 4.99039259 -1.7241027
H  0.15582037 5.45055202 -1.65311725
H  1.87296341 5.72817591 -2.04304967
H  1.11266675 4.15280539 -2.41755514
C  1.57005647 5.560304 0.65734002
H  2.22811373 6.35421759 0.3085886
H  0.56053028 5.93985867 0.79620894
H  1.94084003 5.13494651 1.5876317
H  2.4990286 4.13175685 -0.46666208
H  3.45727354 0.88867585 0.52365868
H  3.69349517 2.81052942 -0.14114457
