program: Gaussian 16
title: Me_H-H+
version: ES64L-G16RevC.01
method: RwB97XD
basis: GenECP
operation: Freq
keyword: #N
keyword: Geom=AllCheck
keyword: Guess=TCheck
keyword: SCRF=Check
keyword: GenChk
keyword: RwB97XD/GenECPFreq
converged: YES YES NO YES
title: Mulliken charges:
elementType: C H C N N B H C H H H H H C C H H H
charge: 0.213013 0.337860 -0.063591 0.030468 -0.152224 -0.096851 0.437556 -0.384064 0.238874 0.226730 0.199902 0.037862 -0.017082 0.148446 -0.829020 0.230984 0.231948 0.209190
chargesum: 1.00000
title: Mulliken charges with hydrogens summed into heavy atoms:
elementType: C C N N B C C C
charge: 0.550873 -0.063591 0.030468 0.285332 -0.076071 0.281442 0.148446 -0.156898
1716.lowfreq: -23.8060 -0.0007 -0.0004 0.0008 41.1794 53.6275 132.1495 191.8659 205.5759
frequency: 130.4788 191.8193 205.3153 227.1944 231.3574 297.7194 312.3215 411.0689 450.2796 596.2664 648.9743 659.4259 693.8763 717.6022 808.3203 849.4958 899.8650 1013.9649 1026.7711 1040.8632 1064.7774 1099.8915 1181.9962 1183.4549 1226.7352 1257.7735 1281.2291 1395.0911 1398.6087 1425.0631 1475.9957 1476.6034 1483.6660 1506.2287 1521.5177 1530.6406 1630.1377 1664.7305 2617.3714 2714.2191 3063.6886 3090.5224 3136.4368 3174.7377 3177.8509 3203.5547 3294.4346 3658.7939
redmass: 2.0518 1.1925 1.1810 2.2728 2.5446 2.5581 2.9094 1.1403 2.5103 4.2535 4.3221 3.6862 4.3346 1.1220 3.2469 1.4389 1.3381 1.4114 1.5517 3.8538 1.5331 1.6174 1.3351 1.3540 2.8899 1.4763 1.4975 2.7698 4.2252 1.3240 1.0824 1.2513 1.3402 1.0381 1.1089 2.8723 5.2518 4.4393 1.0535 1.1321 1.0376 1.0334 1.1016 1.1030 1.1073 1.1060 1.1026 1.0833
irintensity: 1.8255 0.0615 0.1486 1.3064 0.5480 0.0510 2.9185 0.0239 1.8561 9.3168 8.2893 7.3955 2.4817 86.9457 11.1193 15.5933 39.6537 44.4553 2.4296 1.5704 6.6848 24.8765 10.4222 26.4683 4.5827 202.7932 6.7188 13.1987 2.4195 5.6556 11.7193 25.5809 2.7832 35.8041 14.0774 78.8563 119.1674 59.3064 135.0065 94.0050 0.1283 7.2806 0.0197 0.5375 1.5474 0.5018 13.7082 173.5403
temp: 298.150 k
press: 1.00000 atm
elementType: 6 1 6 7 7 5 1 6 1 1 1 1 1 6 6 1 1 1
symmnumber: 1
zpe: 402834.9 jmol-1
zpe.correction: 0.153432 hartree
zpe.thermalcorrener: 0.161621 hartree
zpe.thermalcorrenthalpy: 0.162565 hartree
zpe.thermalcorrgfe: 0.121437 hartree
zpe.sumelectzpe: -330.553206 hartree
zpe.sumelectthermal: -330.545017 hartree
zpe.sumelectthermalent: -330.544073 hartree
zpe.sumelectthermalfe: -330.585201 hartree
dipole: 10.5080 7.4685 -3.3128
dipole: 13.3105
quadrupole: -20.1156 -23.0124 -32.7200
quadrupole: 10.3008 -6.2446 -1.3005
quadrupole: 5.1670 2.2703 -7.4373 10.3008 -6.2446 -1.3005
hfenergy: -330.7066381 hartree
pointgroup: C01 [X(C5H10B1N2)]
dipole: -0.5188123 0.4758714 -0.9096675 debye
dipolederiv: 0.1972357 -0.2984597 0.146199 -0.2709099 0.3871613 -0.154585 0.2090543 -0.2583404 0.187796 0.1602239 0.0354242 -0.0004412 0.0258807 0.129231 -0.0124131 -0.0156261 0.0074712 0.1323058 -0.4626202 0.4802016 -0.2699921 0.463792 -0.72777 0.4208649 -0.3064078 0.4780388 -0.2300832 -0.302305 0.2683146 -0.0526759 0.1700283 -0.4831052 -0.1097984 -0.2551471 0.2359262 -0.5634636 -0.2406876 0.1081195 0.0300793 0.1664026 -0.5037586 -0.0521597 0.1528362 -0.2632549 -0.1863334 0.7425618 -0.4079815 0.2786487 -0.3946638 0.9740508 -0.3187692 0.3030729 -0.3599669 0.7930533 0.3225171 -0.0113487 -0.0299236 -0.0183961 0.370114 0.0239315 -0.0443984 0.0499284 0.2672589 0.3086844 -0.2033699 0.0061876 -0.2039014 0.5321537 -0.0428979 -0.0111252 -0.0082023 0.126478 0.0186168 -0.002456 0.0681575 0.0442064 0.0123203 0.0280574 0.0430919 0.0720701 0.0562384 -0.0065936 0.026228 -0.0408361 -0.0364659 -0.0055136 -0.0212625 -0.0616879 0.0036638 0.1000453 0.1109166 0.0115374 -0.048647 0.0327418 0.0777406 0.0190253 -0.0021636 -0.0547867 -0.0135236 -0.1309879 0.0025001 -0.0070254 -0.0201535 -0.1161042 -0.0494404 -0.0537051 0.0355177 -0.2478904 -0.1583972 0.0414624 -0.0003801 0.0622514 -0.2415373 0.0023472 0.0452894 -0.0780035 -0.1293184 0.2659425 -0.1117311 0.0138773 -0.0788989 0.4378942 0.2047613 0.0956317 0.0726064 0.7029712 -0.023917 0.0358191 -0.0990978 0.0557396 -0.0243172 0.1114207 -0.0606805 0.0365865 -0.1179967 0.0080356 0.0114176 0.0074801 0.010073 0.1350053 -0.0072038 0.02189 0.0186444 0.0245052 0.0921022 -0.0512743 -0.0154863 -0.0568845 0.030315 0.0145303 -0.0442202 0.0155124 0.0337274 0.0986719 0.0655966 0.0138761 0.0491583 0.01612 -0.0564085 -0.0157045 -0.0034112 0.0642297 unknown
polarizability: 74.6356948|-24.9213453|95.6454996|16.7445234|-7.98822|100.6674895 unknown
InChI: InChI=1/C5H10BN2/c1-4-7-5(6)3-8(4)2/h3,7H,6H2,1-2H3
charge 1 multiplicity 1
18 atoms
C  2.64005049 1.60073335 1.06098242
H  2.59950848 2.12292435 2.00309785
C  3.23921668 0.4108555 0.750286
N  2.04440424 2.09781225 -0.06689594
N  2.96934769 0.23623723 -0.60661989
B  4.0275111 -0.55580868 1.64150923
H  3.27437165 -0.55521335 -1.1555887
C  1.28961951 3.34581826 -0.17349844
H  1.79566194 4.0265266 -0.85725992
H  0.28278985 3.13559662 -0.53224502
H  1.23235093 3.79735077 0.81346309
H  4.17695302 -0.26946739 2.78477798
H  4.46545203 -1.56130352 1.17929744
C  2.25842812 1.24553184 -1.08640714
C  1.77987354 1.42828701 -2.47415253
H  0.69001191 1.50053324 -2.49210485
H  2.19194837 2.34829322 -2.8946828
H  2.08621503 0.58938998 -3.09659462
