program: Gaussian 16
title: F_H-H+
version: ES64L-G16RevC.01
method: RwB97XD
basis: GenECP
operation: Freq
keyword: #N
keyword: Geom=AllCheck
keyword: Guess=TCheck
keyword: SCRF=Check
keyword: GenChk
keyword: RwB97XD/GenECPFreq
converged: YES YES YES YES
title: Mulliken charges:
elementType: C H C N N B H C H H H H H C F
charge: -0.078595 0.323653 -0.006948 -0.019885 -0.237455 -0.091610 0.465888 -0.385579 0.251465 0.238975 0.205681 0.043116 -0.009393 0.381161 -0.080472
chargesum: 1.00000
title: Mulliken charges with hydrogens summed into heavy atoms:
elementType: C C N N B C C F
charge: 0.245058 -0.006948 -0.019885 0.228433 -0.057887 0.310542 0.381161 -0.080472
1716.lowfreq: -73.8169 -25.9021 -0.0009 -0.0007 0.0006 36.1971 147.5597 184.0236 233.6317
frequency: 144.2052 181.3781 233.5493 238.4257 274.4089 325.7332 425.5726 512.9394 593.3011 654.2622 661.9845 664.1587 726.8439 849.8150 855.5041 897.7853 1013.4888 1026.6620 1099.3222 1165.9325 1175.9937 1241.7408 1274.2919 1291.7599 1383.2600 1402.2191 1477.3747 1502.7827 1514.8483 1561.1922 1664.6794 1704.6827 2624.9574 2724.8931 3090.8304 3184.3633 3207.8699 3297.5433 3645.3183
redmass: 2.2099 1.8796 2.0961 2.1258 4.0436 2.9665 1.3369 3.7065 4.7601 3.4537 1.2279 5.8016 7.6292 4.0974 1.4525 1.3265 1.4181 4.6069 1.6193 1.3135 1.4241 1.9850 1.6267 2.0085 4.5517 2.7770 1.2577 1.0375 1.0881 6.7011 6.2070 5.9715 1.0529 1.1330 1.0329 1.1092 1.1066 1.1028 1.0838
irintensity: 0.9264 1.1348 2.0755 3.1969 4.7478 0.1172 0.2861 11.2672 19.5906 1.4805 92.3007 27.1240 41.0703 12.3634 12.3602 36.7762 41.7349 0.6508 17.5147 0.1423 35.4113 133.2854 24.0982 42.5264 9.0932 3.1728 13.9619 22.0999 6.8630 110.3158 240.6239 300.5355 109.3780 85.0400 3.3024 0.1121 0.0447 19.5687 243.8781
temp: 298.150 k
press: 1.00000 atm
elementType: 6 1 6 7 7 5 1 6 1 1 1 1 1 6 9
symmnumber: 1
zpe: 308133.4 jmol-1
zpe.correction: 0.117362 hartree
zpe.thermalcorrener: 0.124840 hartree
zpe.thermalcorrenthalpy: 0.125784 hartree
zpe.thermalcorrgfe: 0.085875 hartree
zpe.sumelectzpe: -390.487363 hartree
zpe.sumelectthermal: -390.479886 hartree
zpe.sumelectthermalent: -390.478941 hartree
zpe.sumelectthermalfe: -390.518850 hartree
dipole: 11.3685 7.1755 -0.7039
dipole: 13.4620
quadrupole: -13.5306 -19.7530 -37.8090
quadrupole: 9.9878 -1.9330 2.5390
quadrupole: 10.1670 3.9445 -14.1115 9.9878 -1.9330 2.5390
hfenergy: -390.6047253 hartree
pointgroup: C01 [X(C4H7B1F1N2)]
dipole: -0.2116224 0.3682422 0.0043109 debye
dipolederiv: 0.2144712 -0.3146897 0.1800319 -0.2833987 0.3947667 -0.1834813 0.2455642 -0.2915065 0.2543103 0.1628 0.0347958 0.0003643 0.0247622 0.1366676 -0.0066007 -0.0173897 0.0181348 0.1529156 -0.4419714 0.4625928 -0.1967889 0.4469318 -0.7191702 0.3928456 -0.2297777 0.4440088 -0.0242003 -0.3195707 0.3214427 -0.0419398 0.2101576 -0.5636362 -0.1391032 -0.259596 0.2327975 -0.5754804 -0.2857912 0.1596099 -0.0244832 0.2253081 -0.5970493 -0.0240554 0.123812 -0.2796727 -0.3344464 0.737047 -0.3967601 0.2315984 -0.3669369 0.9597692 -0.2634577 0.2861472 -0.357536 0.7431849 0.3461067 -0.00462 -0.0419579 -0.0143857 0.4123452 0.0572251 -0.0631591 0.0910537 0.3110353 0.3251309 -0.2329543 0.0192098 -0.2342965 0.5756378 -0.0720908 -0.0133679 -0.0036491 0.1148732 0.0233463 0.0065682 0.05607 0.0488294 0.0199206 0.0173682 0.0426567 0.0489107 0.0793047 0.0216298 0.0280489 -0.0296981 -0.0323839 -0.0035729 -0.0265724 -0.05208 -0.0046276 0.1036433 0.1114932 0.0201975 -0.0436106 0.0333039 0.0808845 0.0280482 -0.0064124 -0.034611 -0.0008681 -0.1257626 0.0027825 -0.0020597 -0.0192779 -0.114565 -0.0482999 -0.0453615 0.0308377 -0.2225026 -0.1527351 0.0345109 0.0050391 0.0518724 -0.2255926 -0.0046573 0.0432703 -0.0712907 -0.125256 0.6367472 -0.2413605 0.281054 -0.1979967 0.8419183 0.1482776 0.3676265 -0.0082705 1.7683683 -0.252941 0.1198354 -0.3928293 0.1075108 -0.1983238 0.1245539 -0.4219325 0.1854208 -1.2448816 unknown
polarizability: 62.3717029|-23.960698|84.4090691|12.9437123|-5.7580291|80.3870894 unknown
InChI: InChI=1/C4H7BFN2/c1-8-2-3(5)7-4(8)6/h2,7H,5H2,1H3
charge 1 multiplicity 1
15 atoms
C  2.64373502 1.59494327 1.0700097
H  2.6067396 2.11460829 2.01355222
C  3.23826211 0.40638958 0.75361071
N  2.03866349 2.10961794 -0.05467496
N  2.96772485 0.22483857 -0.61073432
B  4.03505214 -0.55933595 1.64350531
H  3.25810378 -0.56071187 -1.17858355
C  1.28611603 3.36491808 -0.17241551
H  1.81703749 4.04865773 -0.8327918
H  0.29041081 3.15681658 -0.55923036
H  1.20791804 3.79650467 0.82185227
H  4.1800468 -0.2653332 2.78463508
H  4.47815445 -1.5604749 1.17993332
C  2.26445881 1.24708038 -1.04287736
F  1.84414647 1.40984372 -2.24670337
