program: Gaussian 16
title: OCHO_H-H+
version: ES64L-G16RevC.01
method: RwB97XD
basis: GenECP
operation: Freq
keyword: #N
keyword: Geom=AllCheck
keyword: Guess=TCheck
keyword: SCRF=Check
keyword: GenChk
keyword: RwB97XD/GenECPFreq
converged: YES YES YES YES
title: Mulliken charges:
elementType: C H C N N B H C H H H H H C O C O H
charge: 0.201490 0.366396 -0.194855 -0.051829 -0.147964 -0.095610 0.425577 -0.379755 0.234225 0.257750 0.207858 0.036356 -0.014824 0.019989 -0.087131 0.170766 -0.210927 0.262487
chargesum: 1.00000
title: Mulliken charges with hydrogens summed into heavy atoms:
elementType: C C N N B C C O C O
charge: 0.567886 -0.194855 -0.051829 0.277613 -0.074078 0.320079 0.019989 -0.087131 0.433253 -0.210927
1716.lowfreq: -65.6959 -16.7883 -0.0010 -0.0003 -0.0001 25.7570 45.9522 134.2346 148.1523
frequency: 13.6460 131.0737 147.5949 170.7546 199.7847 234.0701 259.2067 282.9140 346.2568 435.2832 478.6082 584.3852 625.0895 652.3974 735.4059 767.1623 786.9770 841.7761 878.4659 891.5570 1008.8593 1024.7382 1033.8574 1048.0890 1103.3991 1160.7482 1185.2579 1234.2480 1267.6186 1282.6232 1379.9697 1393.3028 1409.9973 1473.6011 1497.5521 1513.4463 1547.7177 1640.0508 1677.8036 1874.7129 2622.5222 2721.9014 3090.4711 3168.3955 3183.5979 3202.2654 3291.1118 3633.4746
redmass: 5.4985 1.5446 2.1745 4.0657 2.1274 2.7478 3.3588 5.5431 2.0438 1.6143 3.5134 4.9365 5.5297 4.0015 4.1512 1.2822 4.9971 2.2173 2.4979 1.3458 1.4092 1.6017 4.4158 8.3677 1.5972 1.3159 1.4122 2.1170 1.6802 1.7557 1.7763 4.0852 1.6492 1.2873 1.0442 1.1198 5.4053 7.1926 4.4851 8.9484 1.0528 1.1331 1.0325 1.1051 1.1087 1.1071 1.1033 1.0837
irintensity: 0.3441 2.8858 5.4532 0.6303 3.1388 0.4549 12.6987 7.7807 2.0203 1.3979 1.8328 17.1265 28.5401 3.8167 0.8540 117.5761 37.8016 2.6144 19.8265 40.9668 42.8395 0.8556 8.6009 665.3859 58.7287 3.3317 47.3778 127.2482 122.9866 56.5747 21.6408 4.1687 11.3948 17.3190 21.5680 0.1705 131.6474 248.5708 331.8585 307.9748 122.7643 88.2028 5.9802 2.1704 0.7293 0.3622 17.8989 234.2667
temp: 298.150 k
press: 1.00000 atm
elementType: 6 1 6 7 7 5 1 6 1 1 1 1 1 6 8 6 8 1
symmnumber: 1
zpe: 365661.0 jmol-1
zpe.correction: 0.139273 hartree
zpe.thermalcorrener: 0.149001 hartree
zpe.thermalcorrenthalpy: 0.149945 hartree
zpe.thermalcorrgfe: 0.103005 hartree
zpe.sumelectzpe: -479.782601 hartree
zpe.sumelectthermal: -479.772872 hartree
zpe.sumelectthermalent: -479.771928 hartree
zpe.sumelectthermalfe: -479.818869 hartree
dipole: 10.1977 8.3297 -3.1825
dipole: 13.5464
quadrupole: -30.9367 -33.2301 -35.8992
quadrupole: 13.8721 -2.9763 -4.3261
quadrupole: 2.4186 0.1252 -2.5438 13.8721 -2.9763 -4.3261
hfenergy: -479.9218736 hartree
pointgroup: C01 [X(C5H8B1N2O2)]
dipole: -0.6578882 1.2734917 0.1330346 debye
dipolederiv: 0.1911928 -0.3249258 0.1469424 -0.2884145 0.4445163 -0.1563289 0.2364912 -0.3284944 0.2168014 0.1678185 0.0253042 -0.0071072 0.0210801 0.1331245 -0.0098932 -0.0162735 0.0150824 0.1485065 -0.4189614 0.4280537 -0.2641166 0.4415314 -0.7358378 0.4462869 -0.2368439 0.4034749 -0.2360306 -0.2982452 0.2686836 -0.0330819 0.1832007 -0.5556605 -0.1868377 -0.2698183 0.276101 -0.6420477 -0.253721 0.145383 -0.024021 0.2066836 -0.5640069 -0.0197954 0.0919109 -0.2449451 -0.2879417 0.7025033 -0.3701434 0.2845872 -0.3660356 0.9501757 -0.3566807 0.2928609 -0.3669254 0.8175855 0.3318018 -0.016804 -0.0178774 -0.0214276 0.3970711 0.0580514 -0.0191832 0.0593597 0.3750136 0.3122226 -0.2054633 0.0025838 -0.2338445 0.5834433 -0.0228702 -0.0088528 -0.0173463 0.128262 0.0420067 0.0139763 0.0659468 0.0507995 0.0364614 0.007495 0.0416288 0.0680049 0.0385685 -0.0131757 0.0304053 -0.0185191 -0.0317675 -0.0118387 -0.0072592 -0.0297688 0.013275 0.1188719 0.0967898 0.0077417 -0.0549884 0.0338095 0.075771 0.0066609 -0.0240827 -0.05945 0.0012848 -0.1259179 0.0019312 -0.006721 -0.0187915 -0.1126449 -0.0476837 -0.0473321 0.0293729 -0.248065 -0.1514763 0.0339233 -0.0025293 0.0552184 -0.2306876 0.0101929 0.0384834 -0.0690759 -0.1232923 0.5093787 -0.0670487 0.3374333 -0.0989657 0.612678 0.0869677 0.2680853 0.1977538 1.882439 -0.3172069 0.150966 -0.2831438 0.1355574 -0.6806555 -0.5779983 -0.3026822 -0.535002 -2.5566861 0.5719723 -0.5043445 -0.3344099 -0.2923507 1.5196895 1.3340873 0.1221216 0.4859454 1.9486803 -0.4627451 0.3565188 0.2290391 0.1968576 -0.94758 -0.5647185 -0.1182238 0.0744336 -0.637202 0.115763 0.0258427 -0.0200171 0.0268596 0.0859813 0.0003236 -0.0185208 -0.0015646 0.055252 unknown
polarizability: 72.5175448|-26.2206399|102.0619066|16.0399465|-1.7871761|114.684583 unknown
InChI: InChI=1/C5H8BN2O2/c1-8-2-4(6)7-5(8)10-3-9/h2-3,7H,6H2,1H3
charge 1 multiplicity 1
18 atoms
C  2.63920286 1.60893384 1.11008687
H  2.58896764 2.13917022 2.04707041
C  3.20996373 0.40154061 0.82265123
N  2.08081517 2.12275383 -0.03331852
N  2.96919822 0.20901785 -0.54331346
B  3.96187274 -0.57057855 1.74075966
H  3.25313516 -0.58602934 -1.10193881
C  1.35999668 3.39005127 -0.17760855
H  1.78152061 3.95637723 -1.00565707
H  0.30388119 3.19359813 -0.35462602
H  1.48303784 3.94959434 0.74589603
H  4.08725782 -0.26921541 2.88274039
H  4.3954872 -1.58561811 1.29799674
C  2.29775356 1.24323315 -1.01957547
O  1.85466283 1.49484185 -2.24252071
C  2.08162103 0.60278345 -3.2859183
O  2.66880884 -0.41553038 -3.15709535
H  1.62967994 1.02032624 -4.18679414
